{"text_format":"1","workbook":"xlsx","n_sheets":7,"sheets":[" LW Frontloader CANBUS"," LW Frontloader - AIR","STD Frontloader CANBUS"," STD Frontloader AIR","BODY SPEC CURVE   SUMMARY","CNG PRICING AGILITY","Log of Updates"],"not_rendered":{"charts":0,"images":0,"macros":1,"external_links":0,"defined_names":10,"comments":0,"pivot_tables":0},"unopened":[],"bounds":{"document_bytes":16777216,"sheet_cells":100000,"rows_first":2000,"rows_last":500,"rows_between":2000,"halvings":0,"cell_chars":16384,"cell_head_chars":4096},"cells_cut":0,"cells_raw":0,"read":"whole","date_system":"1900"}

{"sheet":" LW Frontloader CANBUS","index":0,"n_rows":331,"n_cols":18,"rows_kept":331,"cut":false,"hidden":false,"merged":[[50,0,50,1],[51,0,51,1],[52,0,52,1],[53,0,53,1],[57,17,57,22],[96,12,97,14],[176,12,176,14],[179,12,179,14],[194,12,194,14],[176,0,176,1],[179,0,179,1],[182,0,182,1],[200,0,200,1],[197,0,197,1],[194,0,194,1],[191,0,191,1],[188,0,188,1],[75,12,75,14],[57,3,57,8],[57,10,57,11],[57,12,57,14],[50,3,50,8],[72,3,72,8],[64,0,64,1],[64,3,64,8],[65,3,65,8],[65,10,65,11],[65,12,65,14],[73,12,73,14],[72,12,72,14],[76,0,76,1],[76,3,76,8],[64,10,64,11],[63,3,63,8],[62,3,62,8],[92,0,92,1],[93,0,93,1],[91,3,91,8],[92,3,92,8],[91,10,91,11],[92,10,92,11],[72,10,72,11],[235,10,235,11],[164,12,164,14],[165,0,165,1],[165,3,165,8],[165,10,165,11],[165,12,165,14],[133,9,135,9],[207,0,207,1],[207,3,207,8],[207,10,207,11],[207,12,207,14],[206,0,206,1],[206,3,206,8],[206,10,206,11],[206,12,206,14],[208,3,208,8],[208,10,208,11],[212,12,212,14],[170,12,170,14],[64,12,64,14],[65,0,65,1],[68,0,68,1],[276,0,276,1],[240,0,240,1],[230,0,230,1],[227,12,227,14],[228,12,228,14],[217,12,217,14],[168,3,168,8],[217,10,217,11],[217,3,217,8],[79,10,79,11],[80,10,80,11],[80,12,80,14],[96,3,96,8],[171,0,171,1],[171,10,171,11],[171,12,171,14],[164,0,164,1],[164,3,164,8],[164,10,164,11],[161,3,161,8],[82,12,82,14],[172,10,172,11],[83,0,83,1],[83,3,83,8],[83,10,83,11],[83,12,83,14],[208,0,208,1],[133,10,135,11],[133,12,135,14],[158,8,158,11],[79,12,79,14],[170,10,170,11],[325,0,325,1],[325,10,325,11],[325,12,325,14],[238,0,238,1],[293,3,293,8],[279,3,279,8],[292,3,292,8],[292,0,292,1],[277,0,277,1],[280,0,280,1],[285,0,285,1],[287,0,287,1],[278,0,278,1],[291,0,291,1],[291,3,291,8],[283,0,283,1],[245,12,245,14],[259,12,259,14],[251,12,251,14],[287,10,287,11],[284,10,284,11],[288,3,288,8],[288,0,288,1],[281,12,281,14],[283,10,283,11],[300,12,300,14],[282,10,282,11],[282,12,282,14],[310,12,310,14],[301,0,301,1],[301,3,301,8],[301,10,301,11],[326,0,326,1],[326,10,326,11],[326,12,326,14],[327,0,327,1],[327,10,327,11],[327,12,327,14],[328,0,328,1],[328,10,328,11],[328,12,328,14],[241,3,241,8],[235,3,235,8],[236,3,236,8],[74,10,74,11],[75,10,75,11],[75,3,75,8],[217,0,217,1],[247,3,247,8],[234,3,234,8],[234,0,234,1],[223,10,223,11],[229,0,229,1],[229,3,229,8],[229,10,229,11],[226,10,226,11],[224,10,224,11],[224,3,224,8],[232,10,232,11],[219,3,219,8],[126,3,126,8],[139,12,141,14],[93,12,93,14],[94,12,94,14],[0,0,0,14],[55,3,55,8],[53,10,53,11],[52,10,52,11],[53,3,53,8],[49,0,49,1],[49,10,49,11],[50,10,50,11],[49,12,49,14],[51,12,51,14],[52,12,52,14],[49,3,49,8],[51,3,51,8],[53,12,53,14],[55,12,55,14],[50,12,50,14],[43,10,43,11],[43,12,43,14],[44,12,44,14],[47,12,47,14],[54,12,54,14],[52,3,52,8],[48,12,48,14],[47,10,47,11],[55,10,55,11],[54,3,54,8],[54,10,54,11],[5,6,5,8],[40,3,40,4],[40,6,40,7],[55,0,55,1],[54,0,54,1],[48,0,48,1],[56,12,56,14],[57,0,57,1],[58,0,58,1],[58,3,58,8],[58,10,58,11],[58,12,58,14],[47,0,47,1],[47,3,47,8],[51,10,51,11],[48,3,48,8],[48,10,48,11],[61,10,61,11],[60,10,60,11],[70,10,70,11],[172,0,172,1],[75,0,75,1],[123,12,123,14],[120,3,120,8],[120,12,120,14],[117,12,117,14],[124,3,124,8],[123,3,123,8],[117,10,117,11],[124,10,124,11],[110,0,110,1],[110,3,110,8],[133,3,133,8],[139,0,141,1],[139,3,139,8],[139,9,141,9],[139,10,141,11],[61,3,61,8],[69,3,69,8],[63,12,63,14],[62,12,62,14],[70,3,70,8],[172,12,172,14],[160,3,160,8],[223,12,223,14],[222,12,222,14],[220,3,220,8],[220,10,220,11],[226,3,226,8],[224,0,224,1],[222,0,222,1],[223,0,223,1],[221,12,221,14],[220,12,220,14],[223,3,223,8],[226,0,226,1],[171,3,171,8],[172,3,172,8],[163,0,163,1],[163,3,163,4],[163,5,163,8],[163,10,163,11],[163,12,163,14],[170,0,170,1],[170,3,170,8],[208,12,208,14],[212,0,212,1],[212,3,212,8],[212,10,212,11],[273,3,273,8],[289,0,289,1],[290,0,290,1],[290,3,290,8],[287,3,287,8],[286,0,286,1],[231,3,231,8],[246,0,246,1],[247,0,247,1],[246,3,246,8],[286,3,286,8],[249,0,249,1],[277,10,277,11],[278,10,278,11],[240,3,240,8],[237,10,237,11],[250,0,250,1],[250,3,250,8],[250,10,250,11],[258,0,258,1],[258,3,258,8],[258,10,258,11],[264,0,264,1],[264,3,264,8],[264,10,264,11],[275,4,275,8],[269,0,269,1],[260,0,260,1],[281,10,281,11],[281,3,281,8],[281,0,281,1],[280,10,280,11],[301,12,301,14],[302,0,302,1],[302,3,302,8],[302,10,302,11],[302,12,302,14],[303,0,303,1],[291,10,291,11],[288,12,288,14],[285,3,285,8],[306,3,306,8],[306,10,306,11],[306,12,306,14],[307,0,307,1],[297,10,297,11],[282,0,282,1],[283,3,283,8],[293,0,293,1],[282,3,282,8],[293,12,293,14],[297,12,297,14],[290,12,290,14],[298,0,298,1],[298,3,298,8],[298,10,298,11],[298,12,298,14],[299,0,299,1],[299,3,299,8],[299,10,299,11],[299,12,299,14],[324,10,324,11],[324,12,324,14],[291,12,291,14],[292,10,292,11],[292,12,292,14],[284,12,284,14],[286,12,286,14],[285,10,285,11],[283,12,283,14],[284,3,284,8],[284,0,284,1],[305,3,305,8],[305,10,305,11],[305,12,305,14],[311,0,311,1],[311,3,311,8],[311,10,311,11],[311,12,311,14],[312,0,312,1],[312,3,312,8],[312,10,312,11],[312,12,312,14],[313,0,313,1],[313,3,313,8],[313,10,313,11],[313,12,313,14],[306,0,306,1],[285,12,285,14],[290,10,290,11],[318,0,318,1],[322,10,322,11],[322,12,322,14],[323,0,323,1],[323,10,323,11],[323,12,323,14],[320,12,320,14],[321,0,321,1],[321,10,321,11],[321,12,321,14],[318,10,318,11],[318,12,318,14],[319,0,319,1],[319,10,319,11],[319,12,319,14],[320,0,320,1],[303,3,303,8],[303,10,303,11],[303,12,303,14],[304,0,304,1],[304,3,304,8],[304,10,304,11],[304,12,304,14],[305,0,305,1],[316,10,316,11],[316,12,316,14],[317,0,317,1],[317,10,317,11],[317,12,317,14],[314,0,314,14],[315,10,315,11],[315,0,315,1],[278,3,278,8],[280,12,280,14],[277,12,277,14],[277,3,277,8],[316,0,316,1],[273,10,273,11],[274,3,274,8],[300,0,300,1],[300,3,300,8],[300,10,300,11],[276,10,276,11],[279,12,279,14],[276,3,276,8],[279,10,279,11],[295,3,295,8],[295,10,295,11],[295,12,295,14],[296,3,296,8],[296,10,296,11],[296,12,296,14],[297,0,297,1],[297,3,297,8],[278,12,278,14],[289,12,289,14],[293,10,293,11],[294,12,294,14],[295,0,295,1],[296,0,296,1],[287,12,287,14],[289,3,289,8],[289,10,289,11],[273,0,273,1],[56,0,56,1],[56,3,56,8],[56,10,56,11],[71,10,71,11],[71,3,71,8],[60,12,60,14],[66,0,66,1],[66,3,66,8],[66,10,66,11],[66,12,66,14],[59,0,59,1],[59,3,59,8],[59,10,59,11],[59,12,59,14],[61,0,61,1],[61,12,61,14],[62,0,62,1],[62,10,62,11],[63,0,63,1],[60,3,60,8],[63,10,63,11],[69,10,69,11],[60,0,60,1],[68,3,68,8],[71,0,71,1],[69,12,69,14],[71,12,71,14],[67,0,67,1],[67,3,67,8],[67,10,67,11],[67,12,67,14],[68,12,68,14],[78,0,78,1],[70,12,70,14],[78,3,78,8],[78,10,78,11],[78,12,78,14],[82,0,82,1],[88,0,88,1],[88,3,88,8],[88,10,88,11],[88,12,88,14],[82,3,82,8],[82,10,82,11],[79,3,79,8],[81,0,81,1],[72,0,72,1],[70,0,70,1],[76,10,76,11],[76,12,76,14],[74,12,74,14],[68,10,68,11],[89,0,89,1],[89,3,89,8],[89,10,89,11],[89,12,89,14],[91,12,91,14],[84,0,84,1],[84,3,84,8],[84,10,84,11],[84,12,84,14],[86,0,86,1],[86,3,86,8],[86,10,86,11],[86,12,86,14],[87,0,87,1],[87,3,87,8],[87,10,87,11],[87,12,87,14],[90,0,90,1],[90,12,90,14],[90,10,90,11],[90,3,90,8],[85,0,85,1],[91,0,91,1],[73,3,73,8],[73,0,73,1],[74,3,74,8],[74,0,74,1],[73,10,73,11],[79,0,79,1],[80,0,80,1],[80,3,80,8],[99,0,99,1],[99,3,99,8],[99,10,99,11],[99,12,99,14],[100,0,100,1],[100,3,100,8],[100,10,100,11],[100,12,100,14],[101,0,101,1],[101,3,101,8],[101,10,101,11],[101,12,101,14],[92,12,92,14],[94,10,94,11],[96,0,97,1],[96,2,97,2],[96,9,97,9],[96,10,97,11],[97,3,97,4],[97,5,97,8],[98,3,98,8],[98,10,98,11],[98,12,98,14],[94,0,94,1],[95,3,95,8],[95,10,95,11],[95,12,95,14],[93,3,93,8],[93,10,93,11],[94,3,94,8],[98,0,98,1],[95,0,95,1],[105,0,105,1],[105,3,105,8],[105,10,105,11],[105,12,105,14],[106,0,106,1],[106,3,106,8],[106,10,106,11],[106,12,106,14],[107,0,108,1],[107,3,107,8],[107,9,108,9],[107,10,108,11],[107,12,108,14],[108,3,108,4],[108,5,108,8],[102,0,102,1],[102,3,102,8],[102,10,102,11],[102,12,102,14],[103,0,103,1],[103,3,103,8],[103,10,103,11],[103,12,103,14],[104,0,104,1],[104,3,104,8],[104,10,104,11],[104,12,104,14],[109,0,109,1],[109,3,109,8],[109,10,109,11],[109,12,109,14],[111,0,111,1],[111,3,111,8],[111,12,111,14],[112,0,112,1],[112,3,112,8],[112,10,112,11],[112,12,112,14],[111,10,111,11],[110,12,110,14],[113,0,113,1],[113,3,113,8],[113,10,113,11],[113,12,113,14],[110,10,110,11],[117,0,117,1],[117,3,117,8],[118,0,118,1],[118,3,118,8],[118,10,118,11],[118,12,118,14],[119,0,119,1],[119,3,119,8],[119,10,119,11],[119,12,119,14],[114,3,114,8],[114,10,114,11],[114,12,114,14],[115,0,115,1],[115,3,115,8],[115,10,115,11],[115,12,115,14],[116,0,116,1],[116,3,116,8],[116,10,116,11],[116,12,116,14],[114,0,114,1],[130,9,132,9],[130,10,132,11],[130,12,132,14],[133,0,135,1],[126,10,126,11],[125,10,125,11],[127,3,127,8],[126,0,126,1],[126,12,126,14],[120,0,120,1],[120,10,120,11],[121,0,121,1],[121,3,121,8],[121,10,121,11],[121,12,121,14],[122,0,122,1],[122,3,122,8],[122,10,122,11],[122,12,122,14],[160,10,160,11],[160,12,160,14],[161,10,161,11],[159,8,159,11],[151,3,152,6],[161,0,161,1],[161,12,161,14],[152,8,152,11],[153,8,153,11],[154,8,154,11],[155,8,155,11],[156,8,156,11],[157,8,157,11],[160,0,160,1],[123,0,123,1],[123,10,123,11],[124,0,124,1],[124,12,124,14],[127,0,129,1],[127,9,129,9],[127,10,129,11],[127,12,129,14],[136,9,138,9],[136,10,138,11],[136,12,138,14],[125,12,125,14],[125,0,125,1],[130,3,130,8],[125,3,125,8],[130,0,132,1],[136,0,138,1],[136,3,136,8],[218,0,218,1],[218,12,218,14],[231,0,231,1],[236,0,236,1],[222,10,222,11],[227,10,227,11],[218,3,218,8],[218,10,218,11],[222,3,222,8],[221,3,221,8],[221,10,221,11],[221,0,221,1],[220,0,220,1],[219,0,219,1],[232,0,232,1],[232,12,232,14],[236,12,236,14],[235,12,235,14],[234,12,234,14],[219,12,219,14],[224,12,224,14],[229,12,229,14],[234,10,234,11],[230,12,230,14],[230,3,230,8],[230,10,230,11],[227,0,227,1],[227,3,227,8],[219,10,219,11],[225,0,225,1],[225,3,225,8],[225,10,225,11],[235,0,235,1],[228,0,228,1],[237,0,237,1],[241,0,241,1],[237,3,237,8],[238,12,238,14],[242,12,242,14],[225,12,225,14],[226,12,226,14],[231,10,231,11],[232,3,232,8],[236,10,236,11],[243,12,243,14],[241,12,241,14],[244,12,244,14],[240,10,240,11],[242,0,242,1],[240,12,240,14],[249,3,249,8],[249,10,249,11],[249,12,249,14],[231,12,231,14],[237,12,237,14],[241,10,241,11],[243,3,243,8],[243,10,243,11],[244,0,244,1],[244,10,244,11],[233,0,233,1],[233,3,233,8],[233,10,233,11],[233,12,233,14],[329,12,329,14],[330,0,331,1],[330,3,331,8],[330,10,331,11],[330,12,331,14],[320,10,320,11],[324,0,324,1],[322,0,322,1],[270,0,270,1],[270,3,270,8],[269,3,269,8],[269,10,269,11],[269,12,269,14],[263,0,263,1],[263,3,263,8],[263,10,263,11],[263,12,263,14],[315,12,315,14],[279,0,279,1],[265,10,265,11],[265,12,265,14],[268,10,268,11],[268,12,268,14],[273,12,273,14],[276,12,276,14],[294,0,294,1],[294,3,294,8],[294,10,294,11],[288,10,288,11],[286,10,286,11],[280,3,280,8],[25,7,25,8],[25,10,25,13],[27,7,27,13],[29,1,29,3],[29,4,29,6],[29,8,29,13],[31,1,31,3],[31,4,31,6],[31,8,31,13],[33,1,33,3],[33,4,33,6],[33,7,33,10],[33,11,33,13],[178,0,178,1],[178,3,178,8],[178,10,178,11],[178,12,178,14],[167,0,167,1],[167,3,167,8],[167,10,167,11],[167,12,167,14],[168,0,168,1],[168,10,168,11],[168,12,168,14],[169,0,169,1],[169,3,169,8],[169,10,169,11],[169,12,169,14],[142,9,144,9],[142,10,144,11],[142,12,144,14],[145,0,147,1],[180,0,180,1],[180,3,180,8],[180,10,180,11],[180,12,180,14],[145,3,145,8],[145,9,147,9],[145,10,147,11],[145,12,147,14],[148,0,150,1],[148,3,148,8],[148,9,150,9],[148,10,150,11],[148,12,150,14],[142,0,144,1],[142,3,142,8],[162,0,162,1],[162,3,162,8],[162,10,162,11],[162,12,162,14],[181,0,181,1],[181,3,181,8],[258,12,258,14],[253,0,253,1],[253,3,253,8],[13,1,13,6],[13,8,13,13],[14,1,14,4],[14,8,14,11],[15,1,15,4],[15,8,15,11],[16,1,16,3],[16,4,16,6],[16,8,16,10],[16,12,16,13],[17,1,17,3],[17,5,17,6],[17,8,17,10],[17,12,17,13],[20,5,20,13],[21,5,21,13],[22,5,22,8],[22,10,22,11],[181,10,181,11],[181,12,181,14],[183,0,183,1],[183,3,183,8],[183,10,183,11],[183,12,183,14],[184,0,184,1],[184,3,184,8],[184,10,184,11],[2,0,2,1],[2,2,2,5],[2,7,2,9],[2,10,2,13],[4,0,4,1],[4,2,4,5],[4,6,4,8],[4,10,4,13],[7,0,7,2],[7,3,7,6],[7,8,7,13],[8,8,8,13],[9,8,9,11],[9,12,9,13],[10,8,10,10],[10,11,10,13],[11,1,11,6],[11,8,11,13],[12,1,12,6],[12,8,12,13],[173,0,173,1],[173,3,173,8],[173,10,173,11],[173,12,173,14],[174,0,174,1],[174,3,174,8],[174,10,174,11],[174,12,174,14],[175,0,175,1],[175,3,175,8],[175,10,175,11],[175,12,175,14],[177,0,177,1],[177,3,177,8],[177,10,177,11],[177,12,177,14],[34,1,34,3],[34,5,34,6],[36,4,36,6],[41,12,41,14],[40,13,40,14],[40,8,40,12],[39,12,39,14],[39,7,39,11],[39,0,39,2],[23,10,23,11],[24,5,24,6],[24,7,24,8],[24,10,24,13],[25,5,25,6],[184,12,184,14],[185,0,185,1],[185,3,185,8],[185,10,185,11],[185,12,185,14],[186,0,186,1],[186,3,186,8],[186,10,186,11],[186,12,186,14],[187,0,187,1],[187,3,187,8],[187,10,187,11],[187,12,187,14],[189,0,189,1],[189,3,189,8],[189,10,189,11],[189,12,189,14],[238,3,238,8],[238,10,238,11],[190,0,190,1],[190,3,190,8],[190,10,190,11],[190,12,190,14],[202,0,202,1],[202,3,202,8],[202,10,202,11],[202,12,202,14],[203,0,203,1],[203,3,203,8],[203,10,203,11],[203,12,203,14],[204,0,204,1],[204,3,204,8],[204,10,204,11],[204,12,204,14],[192,0,192,1],[192,3,192,8],[192,10,192,11],[192,12,192,14],[193,0,193,1],[193,3,193,8],[193,10,193,11],[193,12,193,14],[195,0,195,1],[195,3,195,8],[195,10,195,11],[195,12,195,14],[228,3,228,8],[228,10,228,11],[255,0,255,1],[255,3,255,8],[205,0,205,1],[205,3,205,8],[205,10,205,11],[205,12,205,14],[209,0,209,1],[209,3,209,8],[209,10,209,11],[209,12,209,14],[210,0,210,1],[210,3,210,8],[210,10,210,11],[210,12,210,14],[250,12,250,14],[252,0,252,1],[252,3,252,8],[252,10,252,11],[252,12,252,14],[246,12,246,14],[247,12,247,14],[248,0,248,1],[248,3,248,8],[248,10,248,11],[248,12,248,14],[215,10,215,11],[247,10,247,11],[246,10,246,11],[244,3,244,8],[242,10,242,11],[242,3,242,8],[243,0,243,1],[69,0,69,1],[166,3,166,8],[166,0,166,1],[271,0,271,1],[271,3,271,8],[271,10,271,11],[271,12,271,14],[272,0,272,1],[272,3,272,8],[272,10,272,11],[272,12,272,14],[266,0,266,1],[266,3,266,8],[266,10,266,11],[266,12,266,14],[267,0,267,1],[256,3,256,8],[215,12,215,14],[216,0,216,1],[216,3,216,8],[216,10,216,11],[216,12,216,14],[196,0,196,1],[196,3,196,8],[196,10,196,11],[196,12,196,14],[198,0,198,1],[198,3,198,8],[198,10,198,11],[198,12,198,14],[262,3,262,8],[262,10,262,11],[166,12,166,14],[166,10,166,11],[211,0,211,1],[211,3,211,8],[211,10,211,11],[211,12,211,14],[213,0,213,1],[264,12,264,14],[265,0,265,1],[265,3,265,8],[214,0,214,1],[214,3,214,8],[214,10,214,11],[214,12,214,14],[215,0,215,1],[215,3,215,8]],"merged_total":1080,"flags":["merged_cut"]}
["New Way Distributor Price Sheet - Mammoth Light Weight Front Loaders CANBUS"]
[null,null,null,null,null,"July 1st 2019 Pricing Rev 1 "]
["Model:",null,null,null,null,null,null,"Requested Ship Date:"]
[null,null,null,null,null,null,null,null,null,null,null,null,null,"Note Penalties If Applicable (Must Be Preapproved)"]
["Date:",null,null,null,null,null,"Purchase Order #:"]
[]
[]
["Distributor Name:",null,null,null,null,null,null,"Contact:"]
[null,null,null,null,null,null,null,null,"Name"]
[]
[null,null,null,null,null,null,null,null,"Email",null,null,"Phone"]
[null,"Bill To:",null,null,null,null,null,null,"Ship To:"]
[]
[null,"Address",null,null,null,null,null,null,"Address"]
[]
[null,"City",null,null,null,"State","Zip",null,"City",null,null,null,"State","Zip"]
[]
[null,"Phone #",null,null,null,"Fax #",null,null,"Phone #",null,null,null,"Fax #"]
[]
[]
["End User Information:"]
[null,null,null,null,null,"Company/Municipal Name"]
[]
[null,null,null,null,null,"Address",null,null,null,null,"City",null,"State","Zip"]
[]
[null,null,null,null,null,"Phone #",null,"Fax #",null,null,"email address"]
[]
["Chassis Dealer:",null,null,null,null,null,"Name:"]
[]
[null,"Chassis Make:",null,null,null,null,null,"Model:"]
[]
[null,"Color:",null,null,null,null,null,"VIN #:"]
[]
[null,null,null,null,null,null,null,"Chassis Frame Height:"]
[null,"Transmission",null,null,null,"Engine"]
[]
[null,null,null,"Chassis Arrival Date:"]
[]
[]
[null,null,null,null,null,null,null,"Total Price",null,null,null,null,{"$f":"SUM(M49:O333)","v":0}]
[null,null,null,{"$f":"IF(D47,5%,0)","v":0},null,null,{"$f":"IF(F47,5%,0)","v":0},null,"Discount Structure (20% Standard) ",null,null,null,null,{"$f":"-(1-0.2)*(1-G41)*(1-D41)+1","v":0.19999999999999996}]
[null,"Stock/Demo Discount must be preapproved",null,null,null,null,null,null,null,null,null,"Grand Total (after discount)",{"$f":"+M40*(1-N41)","v":0}]
[]
[null,"ATD",null,"Percent:",0,"or Dollars",0,null,"Authorization:",null,null,null,{"$f":"IF(E44>0,-E44*M42,IF(G44>0,-G44,0))","v":0}]
[null,"ATD Discount must be preapproved",null,null,null,null,null,null,null,null,null,"Grand Total w/ATD",{"$f":"M42+M44","v":0}]
[]
[null,null,null,false,null,false,null,null," ",null,"July 1st 2019 Pricing  Rev 1 "]
["Quantity",null,"P/N","Description - CANBUS",null,null,null,null,null,null,"Retail Price",null,"Total"]
["stay",null,null,"Body Size In Cubic Yards"]
[null,null,null,"Light Weight Full Eject",null,null,null,null,null,null,null,null,{"$f":"+A50*K50","v":0}]
[null,null,9065,"34yd Eject L.W. (180\"-182\" Wheelbase) ",null,null,null,null,null,null,94674.02,null,0]
[null,null,9062,"40yd Eject L.W. (208\"-210\" Wheelbase)",null,null,null,null,null,null,96091.67,null,0]
[null,null,9066,"43yd Eject L.W. (208\"-210\" Wheelbase)",null,null,null,null,null,null,96532.76,null,0]
[null,null,null,null,null,null,null,null,null,null,null,null,0]
[null,null,null,"(All WB's are Exclusive of Tag or Pusher Axles)"]
["Quantity",null,null,"Mounting Options - CANBUS",null,null,null,null,null,null,"Retail Price",null,"Total Price"]
[{"$f":"IF(A58>0.5,0,\"STD\")","v":"STD"},null,null,"Complete Mount (Standard, No Charge)",null,null,null,null,null,null,{"$f":"$E$40/100*J57","v":0}]
[null,null,107465,"Ship Out (Removes Mounting Services & adds a Mounting Kit including hyd. tank, cab console, wire harness and hoses which must be cut to length and crimped by installer.)",null,null,null,null,null,null,-2167.77,null,{"$f":"+K58*A58","v":0}]
[null,null,130592,"Light Weight Service Hoist",null,null,null,null,null,null,3145,null,{"$f":"+K59*A59","v":0}]
[null,null,132983,"CNG Chassis Service Fee (Required for all CNG fueled chassis to cover handling and and prepping unit for transport)",null,null,null,null,null,null,283.08,null,{"$f":"+K60*A60","v":0}]
["Quantity",null,null,"Scale Options - CANBUS",null,null,null,null,null,null,"Retail Price",null,"Total Price"]
[null,null,131234,"Vulcan Scale Installed - Body (6 Point)",null,null,null,null,null,null,16217.37,null,{"$f":"+K62*A62","v":0}]
[null,null,136774,"Loadman Scale Installed - Body (6 Point)",null,null,null,null,null,null,15365.97,null,{"$f":"+K63*A63","v":0}]
[null,null,132716,"Air Weigh - 3 Axle Scale",null,null,null,null,null,null,6074.75,null,0]
[null,null,136773,"Air Weigh - 4 Axle Scale",null,null,null,null,null,null,8718.44,null,0]
[null,null,131970,"Air Weigh Bin Max Arm Scale with Bluetooth Capability",null,null,null,null,null,null,12647.11,null,0]
[null,null,131703,"Fork Scales - Vulcan R-506",null,null,null,null,null,null,13405.94,null,0]
[null,null,127286,"Fork/Arm Scale - Loadman LM300",null,null,null,null,null,null,24749.59,null,0]
["Quantity",null,null,"Pump/PTO Options - CANBUS",null,null,null,null,null,null,"Retail Price",null,"Total Price"]
[{"$f":"IF(A71+A72+A73>0.5,0,\"STD\")","v":"STD"},null,132621,"Front Mount Vane Pump",null,null,null,null,null,null,{"$f":"$E$40/100*J70","v":0}]
[null,null,105963,"Front Mount Muncie MLS Gear Pump                                                                              (Note: Peterbilt chassis reguires 111 5/8\" arms and bumper extension)",null,null,null,null,null,null,381.33,null,{"$f":"+K71*A71","v":0}]
[null,null,null,"Hot Shift PTO Mount Gear Pump",null,null,null,null,null,null,2776.98,null,{"$f":"+K72*A72","v":0}]
[null,null,null,"Hot Shift PTO Mount Vane Pump",null,null,null,null,null,null,2992.25,null,{"$f":"+K73*A73","v":0}]
["Quantity",null,null,"Axle Assist Options - CANBUS",null,null,null,null,null,null,"Retail Price",null,"Total Price"]
[null,null,133602,"20,000 lb. Pusher Axle w/Aluminum Rims and Tires (singles only)",null,null,null,null,null,null,13286.46,null,{"$f":"+K75*A75","v":0}]
[null,null,133603,"20,000 lb. Pusher Axle w/Steel Rims and Tires (singles only)",null,null,null,null,null,null,12139.08,null,0]
[null,null,133604,"20,000 lb. Pusher Axle w/o Rims and Tires ",null,null,null,null,null,null,9502.02,null,0]
[]
[null,null,133605,"13,200 lb. Pusher Axle w/Aluminum Rims and Tires  ",null,null,null,null,null,null,11695.62,null,0]
[null,null,133606,"13,200 lb. Pusher Axle w/Steel Rims and Tires  ",null,null,null,null,null,null,10549.31,null,0]
[null,null,133607,"13,200 lb. Pusher Axle w/o Rims and Tires  ",null,null,null,null,null,null,8949.85,null,0]
[]
[null,null,133608,"13,200 lb. Tag Axle w/Aluminum Rims and Tires ",null,null,null,null,null,null,12569.62,null,0]
[null,null,133609,"13,200 lb. Tag Axle w/Steel Rims and Tires ",null,null,null,null,null,null,11422.23,null,0]
[null,null,133610,"13,200 lb. Tag Axle w/o Rims and Tires ",null,null,null,null,null,null,9821.69,null,0]
[]
[null,null,133611,"13,200 lb. Steerable Tag w/Aluminum Rims and Tires                             ",null,null,null,null,null,null,13754.68,null,0]
[null,null,133612,"13,200 lb. Steerable Tag w/Steel Rims and Tires                              ",null,null,null,null,null,null,12607.29,null,0]
[null,null,133613,"13,200 lb. Steerable Tag w/o Rims and Tires                              ",null,null,null,null,null,null,1106.76,null,0]
[1,null,null,"**Consult Factory For CT/WB Requirements**",null,null,null,null,null,null,null,null,0]
["Quantity",null,null,"Lighting Options - CANBUS",null,null,null,null,null,null,"Retail Price",null,"Total Price"]
["STD",null,null,"LED Body Lights including Reverse and License Plate",null,null,null,null,null,null,{"$f":"$E$40/100*J92","v":0}]
[null,null,131109,"LED Backup Lights - mounted mid body (2 Lights)",null,null,null,null,null,null,381.03,null,{"$f":"+K93*A93","v":0}]
[null,null,129885,"LED High Intensity Backup Lights - mounted on tailgate (2 Lights)",null,null,null,null,null,null,440.23,null,0]
[null,null,131111,"LED High Intensity Work Lights (2 Lights in Hopper and 1 on Canopy)",null,null,null,null,null,null,381.03,null,0]
[null,null,133389,"LED Work Lights Mounted on Canopy Directed Toward Can (2 Lights)",null,null,null,null,null,null,472.52,null,{"$f":"+K96*A96","v":0}]
[null,null,118816,"Strobe Light Beacon (Surface Mount)",null,null,null,null,null,null,378.88,null,{"$f":"+K97*A97","v":0}]
[null,null,null,"Location--->",null,"Center Tailgate (standard location - edit if other location required)"]
[null,null,131962,"Strobe Light Package (Integrated Strobe System with Turn Signals - 2 round lights mounted in upper tailgate)",null,null,null,null,null,null,452.07,null,{"$f":"+K99*A99","v":0}]
[null,null,130555,"Strobe Light Package (Integrated Strobe System with Turn Signals - 2 round lights mounted in lower tailgate)",null,null,null,null,null,null,452.07,null,0]
[null,null,136783,"LED Round Strobes - 2 lights mounted in upper tailgate",null,null,null,null,null,null,452.07,null,0]
[null,null,130566,"LED Oval Strobes - 2 lights mounted in upper tailgate",null,null,null,null,null,null,488.66,null,0]
[null,null,130567,"LED Oval Strobes - 2 lights mounted in lower tailgate",null,null,null,null,null,null,488.66,null,0]
[null,null,131963,"Upper Light Bar - 2 Stop/Tail lights & 2 Turn Signal lights",null,null,null,null,null,null,463.5,null,0]
[null,null,130440,"Traffic Advisor Board (mounted mid tailgate)",null,null,null,null,null,null,923.51,null,0]
["STD",null,null,"Center Mount Brake (I.D. Cluster)",null,null,null,null,null,null,{"$f":"$E$40/100*J106","v":0}]
[null,null,130209,"Brush Guards For Upper Tailgate Light Bar (protects up to 4 lights)",null,null,null,null,null,null,194.82,null,0]
[null,null,136826,"Wiring Circuit Including switch for customer installed lights (includes switch in cab and 16 ga. wire to designated location)",null,null,null,null,null,null,182.98,null,0]
[null,null,null,"Light Location--->"]
[null,null,null,"Custom Lighting Packages: Consult your RSM for pricing and note in \"Special Instructions\" at bottom",null,null,null,null,null,null,"Consult Factory"]
["Quantity",null,null,"Safety Device Options - CANBUS",null,null,null,null,null,null,"Retail Price",null,"Total Price"]
[null,null,115670,"Back-up Alarm Upgrade (102 db)",null,null,null,null,null,null,86.11,null,{"$f":"+K112*A112","v":0}]
[null,null,135197,"Back-up Alarm Auto Volume Adjustable (87 - 112 db)",null,null,null,null,null,null,168.9,null,{"$f":"+K113*A113","v":0}]
["STD",null,null,"Over Height Warning Light - Provides visual alert when arms/forks are above cab",null,null,null,null,null,null,{"$f":"$E$40/100*J114","v":0}]
[null,null,129879,"Over Height Warning Buzzer - Provides audible alert when arms/forks are above cab",null,null,null,null,null,null,203.43,null,{"$f":"+K115*A115","v":0}]
[null,null,null,"Back Up Collision Avoidance Sensor - Safety Vision camera system",null,null,null,null,null,null,799.73,null,{"$f":"+K116*A116","v":0}]
[null,null,null,"Back Up Collision Avoidance Sensor - 3rd Eye camera system",null,null,null,null,null,null,1314.22,null,{"$f":"+K117*A117","v":0}]
["STD",null,133508,"Body Hold-down Lock",null,null,null,null,null,null,0]
[{"$f":"IF(A120>0.5,0,IF(A58>0.5,0,\"STD\"))","v":"STD"},null,113305,"Fire Extinguisher--10lb. (standard equipment on mounted units only)",null,null,null,null,null,null,{"$f":"$E$40/100*J119","v":0}]
[null,null,113724,"Fire Extinguisher--20lb. (upgrade from 10 lb. - available on mounted units only)",null,null,null,null,null,null,109.92,null,{"$f":"+K120*A120","v":0}]
[null,null,116227,"Triangle Kit (standard equipment and only available on mounted units)",null,null,null,null,null,null,0]
[null,null,113426,"Caution Decal for Tailgate (Large)",null,null,null,null,null,null,290.61,null,{"$f":"+K122*A122","v":0}]
[null,null,128553,"Transition at top of roof from ladder",null,null,null,null,null,null,929.97,null,{"$f":"+K123*A123","v":0}]
[null,null,130550,"Fall Restraint System for Roof",null,null,null,null,null,null,3138.64,null,{"$f":"+K124*A124","v":0}]
[null,null,126237,"Ladder Down Interlock to Shut Down Hydraulic System",null,null,null,null,null,null,349.81,null,{"$f":"+K125*A125","v":0}]
["Quantity",null,null,"Camera Options - CANBUS",null,null,null,null,null,null,"Retail Price",null,"Total Price"]
[null,null,null,"Pricing reflects our standard systems with a camera mouted on the center of the tailgate as the first location. Consult your RSM for pricing on specific brands or models and note in Special Instructions section."]
[{"$f":"IF(A131+A134+A137+A140+A143+A146+A149>0.5,0,\"STD\")","v":"STD"},null,134376,"Dual Camera system with 7\" Color Flat Screen Monitor                                                 Center Tailgate location standard - Choose 1 additional location from list below:",null,null,null,null,null,null,{"$f":"$E$40/100*J128","v":0}]
[null,null,null,null,"1st","2nd"]
[null,null,null,null,1]
[null,null,134377,"Triple Camera system with 7\" Color Flat Screen Monitor                                                  Center Tailgate location standard - Choose 2 additional locations from list below:",null,null,null,null,null,null,708.24,null,{"$f":"K131*A131","v":0}]
[null,null,null,null,"1st","2nd","3rd"]
[null,null,null,null,1]
[null,null,134378,"Quad Camera system with 7\" Color Flat Screen Monitor                                                 Center Tailgate location standard - Choose 3 additional locations from list below:",null,null,null,null,null,null,1238.8800000000001,null,{"$f":"+K134*A134","v":0}]
[null,null,null,null,"1st","2nd","3rd","4th"]
[null,null,null,null,1]
[null,null,136777,"Triple Camera system with 7\" Color Flat Screen Monitor & DVR                                                 Center Tailgate location standard - Choose 2 additional locations from list below:",null,null,null,null,null,null,2346.44,null,{"$f":"K137*A137","v":0}]
[null,null,null,null,"1st","2nd","3rd"]
[null,null,null,null,1]
[null,null,136778,"Quad Camera system with 7\" Color Flat Screen Monitor & DVR                                                Center Tailgate location standard - Choose 3 additional locations from list below:",null,null,null,null,null,null,2877.08,null,{"$f":"+K140*A140","v":0}]
[null,null,null,null,"1st","2nd","3rd","4th"]
[null,null,null,null,1]
[null,null,136675,"3rd Eye Dual Camera system with 7\" Color Flat Screen Monitor                                                 Center Tailgate location standard - Choose 1 additional location from list below:",null,null,null,null,null,null,726.54,null,{"$f":"+K143*A143","v":0}]
[null,null,null,null,"1st","2nd"]
[null,null,null,null,1]
[null,null,134010,"3rd Eye Triple Camera system with 7\" Color Flat Screen Monitor                                                  Center Tailgate location standard - Choose 2 additional locations from list below:",null,null,null,null,null,null,1434.77,null,{"$f":"+K146*A146","v":0}]
[null,null,null,null,"1st","2nd","3rd"]
[null,null,null,null,1]
[null,null,136709,"3rd Eye Quad Camera system with 7\" Color Flat Screen Monitor                                                Center Tailgate location standard - Choose 3 additional locations from list below:",null,null,null,null,null,null,2143.0100000000002,null,{"$f":"+K149*A149","v":0}]
[null,null,null,null,"1st","2nd","3rd","4th"]
[null,null,null,null,1]
[null,null,null,"Additional Camera Locations"]
[null,null,null,null,null,null,null,1,"Center Tailgate - facing rearward"]
[null,null,null,null,null,null,null,2,"Bulkhead"]
[null,null,null,null,null,null,null,3,"Body - Streetside, facing rearward"]
[null,null,null,null,null,null,null,4,"Midbody - facing into hopper"]
[null,null,null,null,null,null,null,5,"Tailgate - curbside to view alley"]
[null,null,null,null,null,null,null,6,"Dash - facing forward"]
[null,null,null,null,null,null,null,7,"Dash - facing driver"]
[null,null,null,null,null,null,null,99,"Other - describe in Special Instructions section"]
["Quantity",null,null,"Paint Options - CANBUS",null,null,null,null,null,null,"Retail Price",null,"Total Price"]
[null,null,null,"Two Tone, Custom Paint or Special Designs (Mounted Units Only - Must submit design drawing with this form including detailed dimensions, design specifics, logos and paint codes)  Contact your RSM for pricing and note in \"Special Instructions\""]
[null,null,null,"(We Use Axalta Imron Elite)"]
[{"$f":"1-A169","v":1},null,null,"Code:"]
[{"$f":"IF(A166+A167>0.5,0,\"STD\")","v":"STD"},null,133588,"Acrylic Urethane Enamel (White) - MUST ENTER PAINT CODE ABOVE",null,null,null,null,null,null,{"$f":"$E$40/100*J165","v":0}]
[null,null,136964,"Acrylic Urethane Enamel Color Coat - MUST ENTER COLOR & CODE ABOVE",null,null,null,null,null,null,1731.85,null,{"$f":"+K166*A166","v":0}]
[null,null,110157,"Two Tone Or Special Design (Mounted Units Only)",null,null,null,null,null,null,"Consult Factory"]
[0,null,133568,"Clear Coat",null,null,null,null,null,null,2401.34,null,{"$f":"+K168*A168","v":0}]
[0,null,133600,"Prime Inside Body (Recommended for Stock Units)",null,null,null,null,null,null,610.29,null,{"$f":"+K169*A169","v":0}]
[0,null,119124,"Body Undercoating/Bedliner (Mounted Units only - applied from frame rails to edge of hopper and body)",null,null,null,null,null,null,3519.66,null,{"$f":"+K170*A170","v":0}]
[0,null,136776,"Body Undercoating/Bedliner (Mounted Units only - applied from frame rails to edge of body.  Does not include bottom of hopper)",null,null,null,null,null,null,2346.44,null,0]
[0,null,136186,"Body Undercoating/Bedliner Applied to Canopy/Cab Cover",null,null,null,null,null,null,570.47,null,0]
["Quantity",null,null,"Steel Options - CANBUS",null,null,null,null,null,null,"Retail Price",null,"Total Price"]
[{"$f":"IF(A175+A176>0.5,0,\"STD\")","v":"STD"},null,null,"Body Roof to 12GA 80K",null,null,null,null,null,null,{"$f":"$E$40/100*J174","v":0}]
[null,null,{"$f":"IF(A$51>0.5,130733,130544)","v":130544},"Body Roof to 10GA 80K-40YD (130733-34YD)",null,null,null,null,null,null,193.74,null,{"$f":"+K175*A175","v":0}]
[null,null,{"$f":"IF(A$51>0.5,132999,133000)","v":133000},"Body Roof to 1/8\" AR450-40YD (132999-34YD)",null,null,null,null,null,null,861.08,null,{"$f":"+K176*A176","v":0}]
[]
[{"$f":"IF(A179>0.5,0,\"STD\")","v":"STD"},null,null,"Roof Door Expanded Metal",null,null,null,null,null,null,{"$f":"$E$40/100*J178","v":0}]
[null,null,130545,"Roof Door Solid Metal 14GA",null,null,null,null,null,null,{"$f":"$E$40/100*J179","v":0},null,{"$f":"+K179*A179","v":0}]
[]
[{"$f":"IF(A182>0.5,0,\"STD\")","v":"STD"},null,null,"Body Sides 1/8\" AR 450",null,null,null,null,null,null,0]
[null,null,130528,"Body Sides 3/16\" AR450-40YD (132413-34YD)",null,null,null,null,null,null,1387.42,null,{"$f":"+K182*A182","v":0}]
[]
[{"$f":"IF(A185+A186>0.5,0,\"STD\")","v":"STD"},null,null,"Body Floor 1/8\" AR450",null,null,null,null,null,null,0]
[null,null,{"$f":"IF(A$51>0.5,131713,130201)","v":130201},"Body Floor 3/16\" AR235-40YD (131713-34YD)",null,null,null,null,null,null,231.42,null,{"$f":"+K185*A185","v":0}]
[0,null,{"$f":"IF(A$51>0.5,132997,132998)","v":132998},"Body Floor to 3/16\" AR450-40YD (132997-34YD)",null,null,null,null,null,null,1174.3,null,{"$f":"+K186*A186","v":0}]
[0,null,131448,"Body Floor Liner 36\" Into Body 3/16\" AR450",null,null,null,null,null,null,694.25,null,{"$f":"+K187*A187","v":0}]
[0,null,{"$f":"IF(A$51>0.5,132995,130017)","v":130017},"Body Floor Liner 3/16\" AR450-40YD (132995-34YD)",null,null,null,null,null,null,2081.66,null,{"$f":"+K188*A188","v":0}]
[]
[{"$f":"IF(A191>0.5,0,\"STD\")","v":"STD"},null,null,"Hopper Sides 3/16\" AR450",null,null,null,null,null,null,{"$f":"$E$40/100*J190","v":0}]
[null,null,130203,"Hopper Sides 1/4\" AR450",null,null,null,null,null,null,1123.71,null,{"$f":"+K191*A191","v":0}]
[]
[{"$f":"IF(A194>0.5,0,\"STD\")","v":"STD"},null,null,"Hopper Floor 3/16\" AR450",null,null,null,null,null,null,{"$f":"$E$40/100*J193","v":0}]
[null,null,129924,"Hopper Floor 1/4\" AR450",null,null,null,null,null,null,578,null,{"$f":"+K194*A194","v":0}]
[]
[{"$f":"IF(A197>0.5,0,\"STD\")","v":"STD"},null,128255,"Front Sump w/ Dual Clean Out Doors",null,null,null,null,null,null,{"$f":"$E$40/100*J196","v":0}]
[null,null,132681,"No Hopper Cleanouts (Deduct)",null,null,null,null,null,null,-628.59,null,{"$f":"+K197*A197","v":0}]
[]
[{"$f":"IF(A200>0.5,0,\"STD\")","v":"STD"},null,null,"Tailgate Bubble 1/8\" AR450",null,null,null,null,null,null,0]
[0,null,130974,"Tailgate Bubble 3/16\" AR450",null,null,null,null,null,null,693.17,null,{"$f":"+K200*A200","v":0}]
[]
[{"$f":"IF(A203>0.5,0,\"STD\")","v":"STD"},null,null,"Packer Panel Lower Face 3/16\" AR450",null,null,null,null,null,null,0]
[0,null,130525,"Packer Panel Lower Face Liner 3/16\" AR450",null,null,null,null,null,null,683.17,null,{"$f":"+K203*A203","v":0}]
[{"$f":"IF(A205>0.5,0,\"STD\")","v":"STD"},null,null,"Packer Panel Sloped Face 3/16\" AR450",null,null,null,null,null,null,0]
[0,null,130526,"Packer Panel Sloped Face & Lower Liners 3/16\" AR450",null,null,null,null,null,null,1178.5999999999999,null,{"$f":"+K205*A205","v":0}]
[0,null,136782,"Super Track Bottom Wear Strip (Hopper Only)",null,null,null,null,null,null,244.39,null,0]
[0,null," "," ",null,null,null,null,null,null,0,null,0]
[0,null,130212,"Ejection Panel Liner Construction Grade 3/16 AR450",null,null,null,null,null,null,1111.31,null,0]
[0,null," "," ",null,null,null,null,null,null,0,null,0]
[" ",null,127681,"Aluminum Canopy (short extension)",null,null,null,null,null,null,0]
[{"$f":"IF(A212+A213+A215+A216>0.5,0,\"STD\")","v":"STD"},null,127682,"Aluminum Canopy (long extension)",null,null,null,null,null,null,0]
[null,null,132153,"Aluminum Canopy With Air Cylinder Extension",null,null,null,null,null,null,1394.95,null,{"$f":"+K212*A212","v":0}]
[0,null,133999,"Steel Canopy With Stell Extension that is Air Raised",null,null,null,null,null,null,833.09,null,{"$f":"+K213*A213","v":0}]
[0,null,127683,"Steel Canopy (short extension)",null,null,null,null,null,null,0,null,0]
[null,null,127684,"Steel Canopy (long extension)",null,null,null,null,null,null,0,null,0]
[null,null,136780,"Torque Tube Reinforcement Inserts",null,null,null,null,null,null,194.82,null,{"$f":"+K216*A216","v":0}]
[null,null,null,"Custom Steel Packages: Consult your RSM for pricing and note in \"Special Instructions\" at bottom",null,null,null,null,null,null,"Consult Factory"]
["Quantity",null,null,"Hydraulics - CANBUS",null,null,null,null,null,null,"Retail Price",null,"Total Price"]
["STD",null,null,"Filter By-Pass Visual Indicator on Filter Housing",null,null,null,null,null,null,{"$f":"$E$40/100*J219","v":0},null,0]
[0,null,129868,"Filter By-Pass Visual Indicator In Cab",null,null,null,null,null,null,271.24,null,{"$f":"+K220*A220","v":0}]
[0,null,131014,"High Temperature Fluid Switch Visual Indicator in Cab",null,null,null,null,null,null,532.79,null,{"$f":"+K221*A221","v":0}]
[0,null,129871,"Low Fluid Level Switch Visual Indicator in Cab",null,null,null,null,null,null,532.79,null,{"$f":"+K222*A222","v":0}]
[0,null,129869,"Hydraulic Shut Down When One or More of the Following Condtitions Exist:  Filter By-Pass, High Temperature Fluid and/or Low Fluid Level (NOTE: REQUIRES VISUAL INDICATOR IN CAB FOR EACH INPUT) ",null,null,null,null,null,null,568.30999999999995,null,{"$f":"+K223*A223","v":0}]
[0,null,104217,"Hour Meter on PTO",null,null,null,null,null,null,288.45999999999998,null,0]
[0,null,115506,"In Tank Oil Heater (120 Volt w/plug in)",null,null,null,null,null,null,1515.5,null,0]
["STD",null,null,"Aluminum Oil Tank With In Tank Filtration",null,null,null,null,null,null,0]
[0,null,127714,"High Pressure Schroeder Filter",null,null,null,null,null,null,1561.78,null,{"$f":"+K227*A227","v":0}]
["STD",null,null,"Quick Disconnect Port for Pressure Gage",null,null,null,null,null,null,0,null,0]
[0,null,124738,"Quick Disconnect Pressure Gage",null,null,null,null,null,null,106.34,null,{"$f":"+K229*A229","v":0}]
[null,null,null,"Custom Hydraulic Packages:  Consult your RSM for pricing and note in \"Special Instructions\" at bottom",null,null,null,null,null,null,"Consult Factory"]
["Quantity",null,null,"Fork and Arm Options - CANBUS",null,null,null,null,null,null,"Retail Price",null,"Total Price"]
[{"$f":"IF(A233>0.5,0,\"STD\")","v":"STD"},null,128368,"Dual Lever Can Bus Controls",null,null,null,null,null,null,{"$f":"$E$40/100*J232","v":0},null,null,null,null,null,null," "]
[null,null,128363,"Single Handle Quad Can Bus Control Joystick",null,null,null,null,null,null,{"$f":"$E$40/100*J233","v":0}]
[]
[{"$f":"IF(A236>0.5,0,\"STD\")","v":"STD"},null,null,"6,000 lb. Lift Rating (STD WC Version) including 4.25\" Arm Cyl. and 3.5\" Fork Cyl.",null,null,null,null,null,null,{"$f":"$E$40/100*J235","v":0},null,null,null,null,null,null," "]
[0,null,132954,"8,000 lb. Lift Rating on WC Body including 4.5\" Arm Cyl. and 3.5\" Fork Cyl.",null,null,null,null,null,null,494.04,null,{"$f":"+K236*A236","v":0}]
[]
[{"$f":"IF(A239+A241+A242+A243+A244+A245+A247+A248+A249+A250+A251+A253+A254+A255+A257+A258+A259>0.5,0,\"STD\")","v":"STD"},null,129844,"Fork Thickness 1\" 100K smooth no hook (48\" usable bumper to tip)",null,null,null,null,null,null,{"$f":"$E$40/100*J238","v":0}]
[null,null,129531,"Fork Thickness 1\" 100K with hook (44\" usable bumper to tip)",null,null,null,null,null,null,0]
[]
[null,null,110122,"Fork Thickness 1 1/4\" 100K with hook (44\" usable bumper to hook)",null,null,null,null,null,null,144.22999999999999,null,{"$f":"+K241*A241","v":0}]
[null,null,112140,"Fork Thickness 1 1/4\" 100K smooth no hook (48\" usable bumper to tip)",null,null,null,null,null,null,144.22999999999999,null,{"$f":"+K242*A242","v":0}]
[null,null,121901,"Fork Thickness 1 1/4\" 100K with hook (48\" usable bumper to hook)",null,null,null,null,null,null,342.28,null,{"$f":"+K243*A243","v":0}]
[null,null,125087,"Fork Thickness 1 1/4\" 100K with hook (58-1/2\" usable bumper to hook)",null,null,null,null,null,null,559.70000000000005,null,{"$f":"+K244*A244","v":0}]
[null,null,125085,"Fork Thickness 1 1/4\" 100K with hook (66\" usable bumper to hook)",null,null,null,null,null,null,874,null,{"$f":"+K245*A245","v":0}]
[]
[null,null,108746,"Fork Thickness 1 1/2\" 100K with hook (44\" usable bumper to hook)",null,null,null,null,null,null,566.16,null,0]
[null,null,121843,"Fork Thickness 1 1/2\" 100K with hook (48\" usable bumper to hook)",null,null,null,null,null,null,667.34,null,0]
[null,null,125084,"Fork Thickness 1 1/2\" 100K with hook (58\" usable bumper to hook)",null,null,null,null,null,null,920.28,null,0]
[null,null,120162,"Fork Thickness 1 1/2\" 100K with hook (61\" usable bumper to hook)",null,null,null,null,null,null,995.62,null,0]
[null,null,124649,"Fork Thickness 1 1/2\" 100K with hook (66\" usable bumper to hook)",null,null,null,null,null,null,1122.6300000000001,null,0]
[]
[null,null,125082,"Fork Thickness 1 1/2\" 100K smooth no hook (48\" usable bumper to tip)",null,null,null,null,null,null,667.34,null,0]
[null,null,130055,"Fork Thickness 1 1/2\" 100K smooth no hook (58-1/2\" usable bumper to tip)",null,null,null,null,null,null,920.28,null,0]
[null,null,109306,"Fork Thickness 1 1/2\" 100K smooth no hook (65\" usable bumper to tip)",null,null,null,null,null,null,1122.6300000000001,null,0]
[]
[null,null,130564,"Fork Width Adjustment Hydraulic (both sides  22\" ea) 50.75\" Usable Smooth 1 1/2\"",null,null,null,null,null,null,3259.19,null,{"$f":"+K257*A257","v":0}]
[null,null,130565,"Fork Width Adjustment Hydraulic (both sides  22\" ea) 46.5\" Usable Hook",null,null,null,null,null,null,3158.01,null,0]
[null,null,136784,"Fork Width Adjustment Hydraulic (both sides  22\" ea) Bottom Pocket Forks",null,null,null,null,null,null,3158.01,null,0]
[]
[0,null,118855,"Fork Limiter to retain can on forks during dumping",null,null,null,null,null,null,203.43,null,0]
[0,null,130177,"Fork Cylinders Upgrade - Increase from 3.5\" to 4\" Diameter",null,null,null,null,null,null,371.34,null,0]
[null,null,null,null,null,null,null,null,null,null,null,null,0]
[null,null,null,"Residential Package Options - CANBUS"]
[0,null,129884,"Outside Controls For Arms, Forks, Packing w/ E- Stop",null,null,null,null,null,null,1436.93,null,0]
[0,null,129882,"Curbside In Cab Arm/Fork Controls",null,null,null,null,null,null,1215.2,null,0]
[0,null,131628,"Deceleration On Arms Down Function",null,null,null,null,null,null,1109.72,null,0]
[0,null,130546,"Cradle Support for Arms Down",null,null,null,null,null,null,518.79999999999995,null,{"$f":"+K268*A268","v":0}]
[0,null,130551,"Curotto Can Ready with Controls, Plumbing to Quick Disconnects at Fork Pivot, Harnesses, Cradle to Support Arms Down and Deceleration Arms Down (With Out Automated Arm and Can)",null,null,null,null,null,null,14912.83,null,{"$f":"+K269*A269","v":0}]
[0,null,132218,"Complete Residential Package Including: Residential Carry Can w/tipper fork cradle (includes curbside in cab arm/fork controls)",null,null,null,null,null,null,11769.89,null,{"$f":"+K270*A270","v":0}]
[0,null,129880,"Auto Dump ",null,null,null,null,null,null,4055.69,null,{"$f":"+K271*A271","v":0}]
[0,null,131467,"Plumb Only For Residential Container (Includes Tap-In and Plumbing to front forks)",null,null,null,null,null,null,1947.12,null,{"$f":"+K272*A272","v":0}]
[null,null,null,"Custom Arm/Fork Options:  Consult your RSM                                                                 for pricing and note in \"Special Instructions\" at bottom",null,null,null,null,null,null,"Consult Factory"]
["Quantity",null,null,"Accessories - CANBUS",null,null,null,null,null,null,"Retail Price",null,"Total Price"]
[0,null,130571,"Shovel/Broom Rack",null,null,null,null,null,null,212.04,null,{"$f":"+K275*A275","v":0}]
[null,null,null,"Location:","Back side of front bulkhead screen"]
[0,null,130175,"Extending cleaning tool with broom attachment and holder",null,null,null,null,null,null,306.76,null,{"$f":"+K277*A277","v":0}]
[0,null,104252,"Steel Tool Box 18x18x24 (must confirm space available to mount)",null,null,null,null,null,null,566.16,null,0]
[0,null,104253,"Steel Tool Box 18x18x36 (must confirm space available to mount)",null,null,null,null,null,null,661.96,null,0]
[0,null,104254,"Steel Tool Box 18x18x48 (must confirm space available to mount)",null,null,null,null,null,null,725.46,null,0]
[0,null,115378,"Container Washout Tank Air 35 Gallon (must confirm space available to mount)",null,null,null,null,null,null,1685.56,null,0]
[0,null,113771,"Container Washout Tank Air 50Gallon (must confirm space available to mount)",null,null,null,null,null,null,1820.11,null,0]
[0,null,129862,"Container Disinfectant Tank Elec. 50 Gallon (must confirm space available to mount)",null,null,null,null,null,null,2576.7800000000002,null,0]
[0,null,114463,"Auto Lube (Up to 20 Points)",null,null,null,null,null,null,6499,null,0]
[0,null,131218,"Remote Grease tailgate hinge & cylinders",null,null,null,null,null,null,406.86,null,0]
[{"$f":"IF(A287+A288>0.5,0,\"STD\")","v":"STD"},null,120908,"Sliding Access Door (Fiber Glass)",null,null,null,null,null,null,{"$f":"$E$40/100*J286","v":0}]
[0,null,123701,"Sliding Access Door (Steel)",null,null,null,null,null,null,445.61,null,{"$f":"+K287*A287","v":0}]
[0,null,130487,"Dual Access Door",null,null,null,null,null,null,566.16,null,0]
[0,null,130304,"Rubber Fender Skirt Extension (Required for rear tires wider than 98.5\")-40YD\n(130734-34YD)",null,null,null,null,null,null,290.61,null,0]
[0,null,129845,"National Standard Fire Hose Port",null,null,null,null,null,null,13994.95,null,0]
[0,null,130176,"Aluminum Drip Pan Below Tailgate Seal (135871-Autocar 4-axle)",null,null,null,null,null,null,784.66,null,0]
[0,null,128856,"Upper Tailgate Seal Extension Rubber (Std. 36\" + Additional 36\" Drip Guard)",null,null,null,null,null,null,641.5,null,0]
[null,null,null,"Custom Accessories:  Consult your RSM for pricing and note in \"Special Instructions\" at bottom",null,null,null,null,null,null,"Consult Factory"]
["Quantity",null,null,"Warranty Options - CANBUS",null,null,null,null,null,null,"Retail Price",null,"Total Price"]
["stay",null,null,"All Warranties Are Conditional--Refer To Warranty Statement"]
[]
[{"$f":"IF(A298+A299+A300>0.5,0,\"STD\")","v":"STD"},null,null,"2-Year Cylinder Warranty",null,null,null,null,null,null,{"$f":"'STD Frontloader CANBUS'!$E$40/100*J297","v":0}]
[null,null,119324,"3-Year Cylinder Warranty",null,null,null,null,null,null,1975.1,null,{"$f":"+K298*A298","v":0}]
[null,null,119325,"4-Year Cylinder Warranty",null,null,null,null,null,null,4489.46,null,{"$f":"+K299*A299","v":0}]
[null,null,119326,"5-Year Cylinder Warranty",null,null,null,null,null,null,5686.36,null,{"$f":"+K300*A300","v":0}]
[]
[{"$f":"IF(A303+A304+A305+A306>0.5,0,\"STD\")","v":"STD"},null,119327,"1-Year Body Warranty",null,null,null,null,null,null,{"$f":"$E$40/100*J302","v":0}]
[null,null,119328,"2-Year Body Warranty",null,null,null,null,null,null,1383.11,null,{"$f":"+K303*A303","v":0}]
[0,null,121178,"3-Year Body Warranty",null,null,null,null,null,null,2766.22,null,{"$f":"+K304*A304","v":0}]
[0,null,130547,"4-Year Body Warranty",null,null,null,null,null,null,4150.41,null,{"$f":"+K305*A305","v":0}]
[0,null,124531,"5-Year Body Warranty",null,null,null,null,null,null,5429.11,null,{"$f":"+K306*A306","v":0}]
[null,null,null,null,null,null,null,null,null,null,null,null,{"$f":"+K307*A307","v":0}]
[{"$f":"IF(A309+A310+A311+A312>0.5,0,\"STD\")","v":"STD"},null,116572,"1-Year Hydraulic Warranty",null,null,null,null,null,null,{"$f":"$E$40/100*J308","v":0}]
[null,null,119329,"2-Year Hydraulic Warranty",null,null,null,null,null,null,1726.47,null,{"$f":"+K309*A309","v":0}]
[0,null,119330,"3-Year Hydraulic Warranty",null,null,null,null,null,null,2586.4699999999998,null,{"$f":"+K310*A310","v":0}]
[null,null,119345,"4-Year Hydraulic Warranty (Excludes Cylinders)",null,null,null,null,null,null,3489.53,null,{"$f":"+K311*A311","v":0}]
[0,null,119331,"5-Year Hydraulic Warranty (Excludes Cylinders)",null,null,null,null,null,null,4391.51,null,{"$f":"+K312*A312","v":0}]
[0]
[0,null,null,"Note: All Extended Hydraulic/Cylinder Warranties include a spare set of \nreplacment filters and breather",null,null,null,null,null,null,null,null,{"$f":"+K314*A314","v":0}]
["Special Instructions CANBUS(Consult Factory for Pricing)"]
["Quantity",null,"Instruction",null,null,null,null,null,null,null,"Retail Price",null,"Total Price"]
[null,null," ",null,null,null,null,null,null,1032.48,null,null,{"$f":"+K317*A317","v":0}]
[null,null,null,null,null,null,null,null,null,null,null,null,{"$f":"+K318*A318","v":0}]
[null,null,null,null,null,null,null,null,null,null,null,null,0]
[null,null,null,null,null,null,null,null,null,null,null,null,0]
[null,null,null,null,null,null,null,null,null,null,null,null,0]
[null,null,null,null,null,null,null,null,null,null,null,null,0]
[null,null,null,null,null,null,null,null,null,null,null,null,0]
[null,null,null,null,null,null,null,null,null,null,null,null,0]
[null,null,null,null,null,null,null,null,null,null,null,null,0]
[null,null,null,null,null,null,null,null,null,null,null,null,0]
[null,null,null,null,null,null,null,null,null,null,null,null,0]
[null,null,null,null,null,null,null,null,null,null,null,null,0]
[null,null,null,null,null,null,null,null,null,null,null,null,0]
[null,null,null,"IF ANY ADDITIONAL ROWS ARE ADDED, CONFIRM $ VALUES ARE ADDED TO THE TOTAL"]
[null,null,null,"BELOW - LIST BREIF SUMMARY OF DELIVERY REQUEST"]

{"sheet":" LW Frontloader - AIR","index":1,"n_rows":331,"n_cols":14,"rows_kept":331,"cut":false,"hidden":false,"merged":[[207,3,207,8],[207,10,207,11],[207,12,207,14],[207,0,207,1],[206,0,206,1],[206,3,206,8],[206,10,206,11],[206,12,206,14],[208,3,208,8],[208,10,208,11],[208,12,208,14],[212,0,212,1],[212,3,212,8],[212,10,212,11],[212,12,212,14],[213,3,213,8],[213,10,213,11],[213,12,213,14],[260,10,260,11],[260,12,260,14],[261,0,261,1],[261,3,261,8],[261,10,261,11],[261,12,261,14],[264,3,264,8],[264,12,264,14],[264,0,264,1],[214,0,214,1],[214,3,214,8],[214,10,214,11],[214,12,214,14],[215,0,215,1],[215,3,215,8],[215,10,215,11],[215,12,215,14],[216,0,216,1],[216,3,216,8],[216,10,216,11],[216,12,216,14],[233,0,233,1],[233,3,233,8],[233,10,233,11],[250,0,250,1],[250,3,250,8],[250,10,250,11],[250,12,250,14],[251,12,251,14],[252,0,252,1],[252,3,252,8],[252,12,252,14],[161,0,161,1],[161,3,161,8],[161,10,161,11],[161,12,161,14],[204,0,204,1],[204,3,204,8],[204,10,204,11],[204,12,204,14],[205,0,205,1],[205,3,205,8],[205,10,205,11],[205,12,205,14],[170,12,170,14],[162,0,162,1],[162,3,162,8],[162,10,162,11],[162,12,162,14],[163,0,163,1],[163,3,163,4],[163,5,163,8],[163,10,163,11],[163,12,163,14],[169,10,169,11],[169,12,169,14],[164,10,164,11],[172,0,172,1],[172,3,172,8],[172,10,172,11],[173,0,173,1],[173,3,173,8],[173,10,173,11],[173,12,173,14],[313,0,313,1],[313,3,313,8],[313,10,313,11],[313,12,313,14],[307,0,307,1],[307,3,307,8],[307,10,307,11],[307,12,307,14],[308,0,308,1],[308,3,308,8],[308,10,308,11],[308,12,308,14],[309,0,309,1],[309,3,309,8],[309,10,309,11],[309,12,309,14],[310,0,310,1],[310,3,310,8],[310,10,310,11],[310,12,310,14],[311,0,311,1],[311,3,311,8],[311,10,311,11],[311,12,311,14],[300,0,300,1],[300,3,300,8],[300,10,300,11],[300,12,300,14],[301,0,301,1],[301,3,301,8],[301,10,301,11],[301,12,301,14],[302,0,302,1],[302,3,302,8],[302,10,302,11],[302,12,302,14],[303,0,303,1],[303,3,303,8],[303,10,303,11],[303,12,303,14],[312,0,312,1],[312,3,312,8],[312,10,312,11],[312,12,312,14],[304,0,304,1],[304,3,304,8],[304,10,304,11],[304,12,304,14],[305,0,305,1],[305,3,305,8],[305,10,305,11],[305,12,305,14],[306,0,306,1],[306,3,306,8],[306,10,306,11],[306,12,306,14],[270,0,270,1],[270,3,270,8],[270,10,270,11],[270,12,270,14],[271,0,271,1],[271,3,271,8],[271,10,271,11],[271,12,271,14],[238,0,238,1],[238,3,238,8],[238,10,238,11],[238,12,238,14],[255,0,255,1],[255,3,255,8],[255,12,255,14],[274,0,275,1],[274,2,275,2],[274,9,275,9],[274,10,275,11],[274,12,275,14],[275,4,275,8],[265,0,265,1],[265,3,265,8],[265,10,265,11],[265,12,265,14],[266,0,266,1],[266,3,266,8],[266,10,266,11],[266,12,266,14],[267,0,267,1],[267,3,267,8],[267,10,267,11],[267,12,267,14],[268,0,268,1],[268,3,268,8],[268,10,268,11],[268,12,268,14],[269,0,269,1],[269,3,269,8],[269,10,269,11],[269,12,269,14],[254,0,254,1],[254,3,254,8],[254,10,254,11],[254,12,254,14],[256,0,256,1],[256,3,256,8],[256,10,256,11],[256,12,256,14],[257,0,257,1],[257,3,257,8],[257,10,257,11],[257,12,257,14],[263,0,263,1],[263,3,263,8],[263,10,263,11],[263,12,263,14],[258,0,258,1],[258,3,258,8],[258,10,258,11],[258,12,258,14],[259,12,259,14],[260,0,260,1],[260,3,260,8],[253,0,253,1],[253,3,253,8],[253,10,253,11],[253,12,253,14],[244,0,244,1],[244,3,244,8],[244,10,244,11],[244,12,244,14],[245,12,245,14],[246,0,246,1],[246,3,246,8],[246,10,246,11],[246,12,246,14],[247,0,247,1],[247,3,247,8],[247,10,247,11],[247,12,247,14],[248,0,248,1],[248,3,248,8],[248,10,248,11],[248,12,248,14],[252,10,252,11],[249,0,249,1],[241,0,241,1],[241,3,241,8],[241,10,241,11],[241,12,241,14],[225,0,225,1],[225,3,225,8],[225,10,225,11],[225,12,225,14],[226,0,226,1],[226,3,226,8],[226,10,226,11],[226,12,226,14],[227,0,227,1],[227,3,227,8],[227,10,227,11],[227,12,227,14],[249,3,249,8],[249,10,249,11],[249,12,249,14],[233,12,233,14],[234,10,234,11],[234,12,234,14],[231,0,231,1],[231,3,231,8],[231,10,231,11],[231,12,231,14],[228,0,228,1],[228,3,228,8],[228,10,228,11],[228,12,228,14],[229,0,229,1],[229,3,229,8],[221,12,221,14],[222,3,222,8],[222,10,222,11],[222,12,222,14],[223,0,223,1],[223,3,223,8],[223,10,223,11],[223,12,223,14],[224,0,224,1],[224,3,224,8],[224,10,224,11],[224,12,224,14],[240,0,240,1],[240,3,240,8],[240,10,240,11],[240,12,240,14],[208,0,208,1],[209,0,209,1],[209,3,209,8],[209,10,209,11],[209,12,209,14],[210,0,210,1],[210,3,210,8],[210,10,210,11],[210,12,210,14],[211,0,211,1],[211,3,211,8],[211,10,211,11],[211,12,211,14],[213,0,213,1],[234,0,234,1],[234,3,234,8],[136,9,138,9],[136,10,138,11],[136,12,138,14],[148,0,150,1],[148,3,148,8],[148,9,150,9],[148,10,150,11],[148,12,150,14],[142,0,144,1],[142,3,142,8],[142,9,144,9],[142,10,144,11],[142,12,144,14],[145,12,147,14],[124,0,124,1],[124,3,124,8],[124,10,124,11],[124,12,124,14],[127,3,127,8],[130,9,132,9],[130,10,132,11],[130,12,132,14],[126,0,126,1],[126,3,126,8],[126,10,126,11],[126,12,126,14],[136,0,138,1],[136,3,136,8],[115,10,115,11],[115,12,115,14],[122,0,122,1],[122,3,122,8],[122,10,122,11],[122,12,122,14],[123,0,123,1],[123,3,123,8],[123,10,123,11],[123,12,123,14],[120,0,120,1],[120,3,120,8],[120,10,120,11],[120,12,120,14],[121,0,121,1],[121,3,121,8],[121,10,121,11],[121,12,121,14],[116,10,116,11],[116,12,116,14],[117,0,117,1],[117,3,117,8],[117,10,117,11],[115,0,115,1],[119,10,119,11],[119,12,119,14],[116,3,116,8],[115,3,115,8],[90,3,90,8],[90,10,90,11],[90,12,90,14],[93,0,93,1],[93,3,93,8],[113,0,113,1],[113,10,113,11],[113,12,113,14],[114,0,114,1],[114,3,114,8],[114,10,114,11],[114,12,114,14],[107,3,107,8],[107,0,108,1],[109,3,109,8],[107,9,108,9],[107,10,108,11],[107,12,108,14],[108,3,108,4],[108,5,108,8],[109,0,109,1],[99,0,99,1],[99,3,99,8],[99,10,99,11],[99,12,99,14],[112,10,112,11],[112,12,112,14],[96,12,96,14],[96,0,97,1],[96,2,97,2],[96,9,97,9],[96,10,97,11],[75,0,75,1],[75,3,75,8],[75,10,75,11],[75,12,75,14],[76,0,76,1],[76,3,76,8],[76,10,76,11],[76,12,76,14],[79,0,79,1],[79,3,79,8],[79,10,79,11],[79,12,79,14],[72,0,72,1],[72,3,72,8],[72,10,72,11],[72,12,72,14],[69,0,69,1],[78,0,78,1],[78,3,78,8],[78,10,78,11],[78,12,78,14],[71,0,71,1],[71,3,71,8],[71,10,71,11],[71,12,71,14],[65,0,65,1],[65,3,65,8],[65,10,65,11],[65,12,65,14],[66,0,66,1],[66,3,66,8],[66,10,66,11],[66,12,66,14],[67,0,67,1],[67,3,67,8],[67,10,67,11],[67,12,67,14],[69,3,69,8],[69,10,69,11],[69,12,69,14],[73,0,73,1],[73,3,73,8],[73,10,73,11],[73,12,73,14],[70,0,70,1],[70,3,70,8],[70,10,70,11],[70,12,70,14],[40,3,40,4],[40,6,40,7],[40,8,40,12],[40,13,40,14],[41,12,41,14],[43,10,43,11],[43,12,43,14],[51,0,51,1],[51,3,51,8],[51,10,51,11],[51,12,51,14],[49,0,49,1],[49,3,49,8],[49,10,49,11],[49,12,49,14],[50,0,50,1],[63,0,63,1],[63,3,63,8],[63,10,63,11],[63,12,63,14],[52,3,52,8],[52,10,52,11],[52,12,52,14],[53,0,53,1],[53,3,53,8],[53,10,53,11],[53,12,53,14],[46,10,46,14],[64,0,64,1],[64,3,64,8],[64,10,64,11],[64,12,64,14],[68,0,68,1],[68,3,68,8],[68,10,68,11],[68,12,68,14],[39,0,39,2],[39,7,39,11],[39,12,39,14],[44,12,44,14],[47,0,47,1],[47,3,47,8],[47,10,47,11],[47,12,47,14],[0,0,0,14],[2,0,2,1],[2,2,2,5],[2,7,2,9],[2,10,2,13],[4,0,4,1],[48,0,48,1],[48,3,48,8],[48,10,48,11],[48,12,48,14],[4,2,4,5],[4,6,4,8],[4,10,4,13],[7,0,7,2],[7,3,7,6],[7,8,7,13],[8,8,8,13],[9,8,9,11],[9,12,9,13],[10,8,10,10],[10,11,10,13],[11,1,11,6],[11,8,11,13],[12,1,12,6],[56,0,56,1],[56,3,56,8],[56,10,56,11],[56,12,56,14],[57,0,57,1],[57,3,57,8],[57,10,57,11],[57,12,57,14],[59,0,59,1],[59,3,59,8],[59,10,59,11],[59,12,59,14],[50,3,50,8],[50,10,50,11],[50,12,50,14],[54,0,54,1],[54,3,54,8],[54,10,54,11],[54,12,54,14],[55,0,55,1],[55,3,55,8],[55,10,55,11],[55,12,55,14],[52,0,52,1],[81,0,81,1],[97,3,97,4],[97,5,97,8],[95,0,95,1],[95,3,95,8],[95,10,95,11],[95,12,95,14],[93,10,93,11],[93,12,93,14],[91,0,91,1],[91,3,91,8],[86,0,86,1],[58,0,58,1],[58,3,58,8],[58,10,58,11],[58,12,58,14],[60,0,60,1],[60,3,60,8],[60,10,60,11],[60,12,60,14],[61,0,61,1],[61,3,61,8],[61,10,61,11],[61,12,61,14],[62,0,62,1],[62,3,62,8],[62,10,62,11],[62,12,62,14],[74,0,74,1],[74,3,74,8],[74,10,74,11],[74,12,74,14],[80,0,80,1],[80,3,80,8],[80,10,80,11],[80,12,80,14],[82,0,82,1],[82,3,82,8],[82,10,82,11],[92,0,92,1],[92,3,92,8],[92,10,92,11],[92,12,92,14],[90,0,90,1],[82,12,82,14],[89,0,89,1],[89,3,89,8],[89,10,89,11],[89,12,89,14],[84,0,84,1],[84,3,84,8],[84,10,84,11],[84,12,84,14],[88,0,88,1],[88,3,88,8],[88,10,88,11],[88,12,88,14],[83,0,83,1],[83,3,83,8],[83,10,83,11],[86,3,86,8],[86,10,86,11],[86,12,86,14],[85,0,85,1],[104,12,104,14],[101,3,101,8],[102,3,102,8],[102,12,102,14],[100,0,100,1],[100,10,100,11],[100,12,100,14],[101,0,101,1],[101,10,101,11],[101,12,101,14],[102,0,102,1],[102,10,102,11],[103,0,103,1],[103,3,103,8],[103,10,103,11],[103,12,103,14],[83,12,83,14],[87,0,87,1],[87,3,87,8],[87,10,87,11],[87,12,87,14],[91,10,91,11],[91,12,91,14],[98,0,98,1],[98,3,98,8],[98,10,98,11],[98,12,98,14],[94,0,94,1],[94,3,94,8],[94,10,94,11],[94,12,94,14],[96,3,96,8],[220,0,220,1],[220,3,220,8],[220,10,220,11],[110,10,110,11],[110,12,110,14],[221,0,221,1],[221,3,221,8],[221,10,221,11],[125,0,125,1],[125,3,125,8],[125,10,125,11],[125,12,125,14],[127,0,129,1],[127,9,129,9],[127,10,129,11],[127,12,129,14],[130,0,132,1],[111,0,111,1],[111,3,111,8],[111,10,111,11],[145,9,147,9],[145,10,147,11],[145,0,147,1],[176,0,176,1],[176,12,176,14],[172,12,172,14],[171,0,171,1],[171,3,171,8],[171,10,171,11],[171,12,171,14],[164,0,164,1],[164,3,164,8],[229,10,229,11],[229,12,229,14],[230,0,230,1],[230,3,230,8],[230,10,230,11],[230,12,230,14],[237,0,237,1],[237,3,237,8],[237,10,237,11],[237,12,237,14],[232,0,232,1],[232,3,232,8],[232,10,232,11],[112,0,112,1],[112,3,112,8],[236,3,236,8],[236,10,236,11],[236,12,236,14],[217,0,217,1],[217,3,217,8],[217,10,217,11],[217,12,217,14],[218,0,218,1],[218,3,218,8],[218,10,218,11],[218,12,218,14],[219,0,219,1],[219,3,219,8],[219,10,219,11],[219,12,219,14],[165,12,165,14],[145,3,145,8],[272,0,272,1],[272,3,272,8],[272,10,272,11],[272,12,272,14],[279,0,279,1],[279,3,279,8],[279,10,279,11],[279,12,279,14],[280,0,280,1],[280,3,280,8],[280,10,280,11],[280,12,280,14],[273,0,273,1],[290,3,290,8],[290,10,290,11],[220,12,220,14],[222,0,222,1],[273,3,273,8],[273,10,273,11],[273,12,273,14],[242,0,242,1],[242,3,242,8],[242,10,242,11],[242,12,242,14],[243,0,243,1],[243,3,243,8],[243,10,243,11],[243,12,243,14],[235,0,235,1],[235,3,235,8],[235,10,235,11],[235,12,235,14],[298,0,298,1],[298,3,298,8],[298,10,298,11],[298,12,298,14],[299,0,299,1],[299,3,299,8],[299,10,299,11],[299,12,299,14],[297,12,297,14],[289,12,289,14],[294,0,294,1],[294,3,294,8],[294,10,294,11],[294,12,294,14],[295,0,295,1],[232,12,232,14],[236,0,236,1],[291,0,291,1],[291,3,291,8],[291,12,291,14],[292,0,292,1],[292,3,292,8],[290,12,290,14],[287,0,287,1],[287,3,287,8],[288,3,288,8],[288,10,288,11],[288,12,288,14],[281,0,281,1],[281,3,281,8],[281,10,281,11],[281,12,281,14],[293,10,293,11],[296,12,296,14],[297,0,297,1],[297,3,297,8],[297,10,297,11],[282,0,282,1],[282,3,282,8],[282,10,282,11],[282,12,282,14],[286,0,286,1],[286,3,286,8],[286,10,286,11],[286,12,286,14],[283,0,283,1],[283,3,283,8],[283,10,283,11],[283,12,283,14],[284,0,284,1],[284,3,284,8],[284,10,284,11],[284,12,284,14],[293,3,293,8],[330,0,331,1],[330,3,331,8],[330,10,331,11],[330,12,331,14],[321,0,321,1],[321,10,321,11],[321,12,321,14],[329,0,329,1],[329,3,329,8],[329,10,329,11],[329,12,329,14],[325,0,325,1],[328,0,328,1],[328,10,328,11],[318,0,318,1],[318,10,318,11],[274,3,274,8],[277,0,277,1],[277,3,277,8],[277,10,277,11],[277,12,277,14],[278,0,278,1],[278,3,278,8],[278,10,278,11],[278,12,278,14],[276,0,276,1],[276,3,276,8],[276,10,276,11],[276,12,276,14],[289,0,289,1],[289,3,289,8],[289,10,289,11],[328,12,328,14],[325,10,325,11],[325,12,325,14],[326,0,326,1],[326,10,326,11],[326,12,326,14],[177,0,177,1],[177,3,177,8],[177,10,177,11],[177,12,177,14],[178,0,178,1],[178,3,178,8],[178,10,178,11],[178,12,178,14],[179,0,179,1],[179,12,179,14],[180,0,180,1],[323,12,323,14],[324,0,324,1],[180,3,180,8],[180,10,180,11],[180,12,180,14],[322,0,322,1],[322,10,322,11],[322,12,322,14],[285,0,285,1],[285,3,285,8],[285,10,285,11],[296,0,296,1],[296,3,296,8],[296,10,296,11],[285,12,285,14],[323,0,323,1],[323,10,323,11],[324,10,324,11],[324,12,324,14],[315,12,315,14],[314,0,314,14],[315,0,315,1],[315,10,315,11],[316,0,316,1],[316,10,316,11],[316,12,316,14],[317,0,317,1],[317,10,317,11],[327,0,327,1],[327,10,327,11],[327,12,327,14],[320,0,320,1],[320,10,320,11],[320,12,320,14],[318,12,318,14],[319,0,319,1],[317,12,317,14],[319,10,319,11],[319,12,319,14],[24,10,24,13],[25,5,25,6],[25,7,25,8],[25,10,25,13],[27,7,27,13],[29,1,29,3],[29,4,29,6],[29,8,29,13],[31,1,31,3],[31,4,31,6],[31,8,31,13],[139,0,141,1],[139,3,139,8],[33,1,33,3],[33,4,33,6],[34,5,34,6],[36,4,36,6],[33,7,33,10],[33,11,33,13],[109,10,109,11],[105,0,105,1],[105,3,105,8],[105,10,105,11],[105,12,105,14],[106,0,106,1],[106,3,106,8],[106,10,106,11],[106,12,106,14],[100,3,100,8],[104,0,104,1],[104,3,104,8],[104,10,104,11],[12,8,12,13],[13,1,13,6],[13,8,13,13],[14,1,14,4],[14,8,14,11],[15,1,15,4],[15,8,15,11],[16,1,16,3],[16,4,16,6],[16,8,16,10],[16,12,16,13],[17,1,17,3],[17,5,17,6],[17,8,17,10],[17,12,17,13],[20,5,20,13],[21,5,21,13],[22,5,22,8],[22,10,22,11],[23,10,23,11],[139,10,141,11],[139,12,141,14],[24,5,24,6],[24,7,24,8],[160,0,160,1],[160,3,160,8],[160,10,160,11],[160,12,160,14],[139,9,141,9],[34,1,34,3],[109,12,109,14],[113,3,113,8],[110,0,110,1],[110,3,110,8],[130,3,130,8],[133,3,133,8],[133,0,135,1],[133,9,135,9],[133,10,135,11],[133,12,135,14],[111,12,111,14],[119,0,119,1],[119,3,119,8],[116,0,116,1],[117,12,117,14],[118,0,118,1],[118,3,118,8],[118,10,118,11],[118,12,118,14],[191,0,191,1],[192,0,192,1],[192,3,192,8],[192,10,192,11],[192,12,192,14],[193,0,193,1],[193,3,193,8],[174,0,174,1],[174,3,174,8],[174,10,174,11],[174,12,174,14],[170,0,170,1],[169,0,169,1],[169,3,169,8],[164,12,164,14],[165,0,165,1],[165,3,165,8],[165,10,165,11],[168,3,168,8],[168,0,168,1],[168,10,168,11],[168,12,168,14],[167,0,167,1],[167,3,167,8],[167,10,167,11],[167,12,167,14],[184,0,184,1],[184,3,184,8],[184,10,184,11],[184,12,184,14],[185,0,185,1],[185,3,185,8],[185,10,185,11],[185,12,185,14],[186,0,186,1],[186,3,186,8],[186,10,186,11],[187,0,187,1],[189,0,189,1],[189,3,189,8],[189,10,189,11],[189,12,189,14],[190,0,190,1],[190,3,190,8],[190,10,190,11],[190,12,190,14],[182,0,182,1],[175,10,175,11],[203,0,203,1],[203,3,203,8],[203,10,203,11],[203,12,203,14],[194,0,194,1],[194,12,194,14],[195,0,195,1],[195,3,195,8],[195,10,195,11],[195,12,195,14],[196,0,196,1],[196,3,196,8],[196,10,196,11],[196,12,196,14],[197,0,197,1],[198,0,198,1],[198,3,198,8],[198,10,198,11],[198,12,198,14],[201,12,201,14]],"merged_total":1074,"flags":["merged_cut"]}
["New Way Distributor Price Sheet - Mammoth Light Weight Front Loaders AIR"]
[null,null,null,null,null,null,"July 1st 2019 Pricing Rev 1"]
["Model:",null,null,null,null,null,null,"Requested Ship Date:"]
[null,null,null,null,null,null,null,null,null,null,null,null,null,"Note Penalties If Applicable (Must Be Preapproved)"]
["Date:",null,null,null,null,null,"Purchase Order #:"]
[]
[]
["Distributor Name:",null,null,null,null,null,null,"Contact:"]
[null,null,null,null,null,null,null,null,"Name"]
[]
[null,null,null,null,null,null,null,null,"Email",null,null,"Phone"]
[null,"Bill To:",null,null,null,null,null,null,"Ship To:"]
[]
[null,"Address",null,null,null,null,null,null,"Address"]
[]
[null,"City",null,null,null,"State","Zip",null,"City",null,null,null,"State","Zip"]
[]
[null,"Phone #",null,null,null,"Fax #",null,null,"Phone #",null,null,null,"Fax #"]
[]
[]
["End User Information:"]
[null,null,null,null,null,"Company/Municipal Name"]
[]
[null,null,null,null,null,"Address",null,null,null,null,"City",null,"State","Zip"]
[]
[null,null,null,null,null,"Phone #",null,"Fax #",null,null,"email address"]
[]
["Chassis Dealer:",null,null,null,null,null,"Name:"]
[]
[null,"Chassis Make:",null,null,null,null,null,"Model:"]
[]
[null,"Color:",null,null,null,null,null,"VIN #:"]
[]
[null,null,null,null,null,null,null,"Chassis Frame Height:"]
[null,"Transmission",null,null,null,"Engine"]
[]
[null,null,null,"Chassis Arrival Date:"]
[]
[]
[null,null,null,null,null,null,null,"Total Price",null,null,null,null,{"$f":"SUM(M49:O332)","v":0}]
[null,null,null,{"$f":"IF(D47,5%,0)","v":0},null,null,{"$f":"IF(F47,5%,0)","v":0},null,"Discount Structure (20% Standard) ",null,null,null,null,{"$f":"-(1-0.2)*(1-G41)*(1-D41)+1","v":0.19999999999999996}]
[null,"Stock/Demo Discount must be preapproved",null,null,null,null,null,null,null,null,null,"Grand Total (after discount)",{"$f":"+M40*(1-N41)","v":0}]
[]
[null,"ATD",null,"Percent:",0,"or Dollars",0,null,"Authorization:",null,null,null,{"$f":"IF(E44>0,-E44*M42,IF(G44>0,-G44,0))","v":0}]
[null,"ATD Discount must be preapproved",null,null,null,null,null,null,null,null,null,"Grand Total w/ATD",{"$f":"M42+M44","v":0}]
[]
[null,null,null,false,null,false,null,null," ",null,"July 1st 2019 Pricing Rev 1"]
["Quantity",null,"P/N","Description - AIR",null,null,null,null,null,null,"Retail Price",null,"Total"]
["stay",null,null,"Body Size In Cubic Yards"]
[null,null,null,"Light Weight Full Eject"]
[null,null,9074,"34yd Eject L.W. (180\"-182\" Wheelbase)",null,null,null,null,null,85445,93754.53,null,{"$f":"+A51*K51","v":0}]
[null,null,9071,"40yd Eject L.W. (208\"-210\" Wheelbase)",null,null,null,null,null,86724,95157.91,null,0]
[null,null,9073,"43yd Eject L.W. (208\"-210\" Wheelbase)",null,null,null,null,null,87123,95595.71,null,0]
[]
[null,null,null,"(All WB's are Exclusive of Tag or Pusher Axles)"]
["Quantity",null,null,"Mounting Options - AIR",null,null,null,null,null,null,"Retail Price",null,"Total Price"]
[{"$f":"IF(A58>0.5,0,\"STD\")","v":"STD"},null,null,"Complete Mount (Standard, No Charge)",null,null,null,null,null,0,{"$f":"$E$40/100*J57","v":0}]
[0,null,107465,"Ship Out (Removes Mounting Services & adds a Mounting Kit including hyd. tank, cab console, wire harness and hoses which must be cut to length and crimped by installer.)",null,null,null,null,null,-2014,-2167.77,null,{"$f":"+K58*A58","v":0}]
[0,null,130592,"Light Weight Service Hoist",null,null,null,null,null,2922,3145.09,null,0]
[0,null,132983,"CNG Chassis Service Fee (Required for all CNG fueled chassis to cover handling and and prepping unit for transport)",null,null,null,null,null,263,283.08,null,{"$f":"+K60*A60","v":0}]
["Quantity",null,null,"Scale Options - AIR",null,null,null,null,null,null,"Retail Price",null,"Total Price"]
[0,null,131234,"Vulcan Scale Installed - Body (6 Point)",null,null,null,null,null,15067,16217.37,null,{"$f":"+K62*A62","v":0}]
[null,null,136774,"Loadman Scale Installed - Body (6 Point)",null,null,null,null,null,14276,15365.97,null,0]
[null,null,132716,"Air Weigh - 3 Axle Scale",null,null,null,null,null,6480,6974.75,null,0]
[null,null,136773,"Air Weigh - 4 Axle Scale",null,null,null,null,null,8100,8718.44,null,0]
[null,null,131970,"Air Weigh Bin Max Arm Scale with Bluetooth Capability",null,null,null,null,null,11750,12647.11,null,0]
[0,null,131703,"Fork Scales - Vulcan R-506",null,null,null,null,null,12455,13405.94,null,0]
[0,null,127286,"Fork/Arm Scale - Loadman LM300",null,null,null,null,null,22994,24749.59,null,0]
["Quantity",null,null,"Pump/PTO Options",null,null,null,null,null,null,"Retail Price",null,"Total Price"]
[{"$f":"IF(A71+A72+A73>0.5,0,\"STD\")","v":"STD"},null,132621,"Front Mount Vane Pump",null,null,null,null,null,0,{"$f":"$E$40/100*J70","v":0}]
[0,null,105963,"Front Mount Muncie MLS Gear Pump                                                                              (Note: Peterbilt chassis reguires 111 5/8\" arms and bumper extension)",null,null,null,null,null,354.28,381.33,null,{"$f":"+K71*A71","v":0}]
[0,null,null,"Hot Shift PTO Mount Gear Pump",null,null,null,null,null,2580,2776.98,null,{"$f":"+K72*A72","v":0}]
[0,null,null,"Hot Shift PTO Mount Vane Pump",null,null,null,null,null,2780,2992.25,null,{"$f":"+K73*A73","v":0}]
["Quantity",null,null,"Axle Assist Options - AIR",null,null,null,null,null,null,"Retail Price",null,"Total Price"]
[0,null,133602,"20,000 lb. Pusher Axle w/Aluminum Rims and Tires (singles only)",null,null,null,null,null,12344,13286.46,null,{"$f":"+K75*A75","v":0}]
[null,null,133603,"20,000 lb. Pusher Axle w/Steel Rims and Tires (singles only)",null,null,null,null,null,11278,12139.08,null,{"$f":"+K76*A76","v":0}]
[0,null,133604,"20,000 lb. Pusher Axle w/o Rims and Tires ",null,null,null,null,null,8828,9502.02,null,0]
[]
[0,null,133605,"13,200 lb. Pusher Axle w/Aluminum Rims and Tires  ",null,null,null,null,null,10866,11695.62,null,{"$f":"+K79*A79","v":0}]
[0,null,133606,"13,200 lb. Pusher Axle w/Steel Rims and Tires  ",null,null,null,null,null,9801,10549.31,null,0]
[0,null,133607,"13,200 lb. Pusher Axle w/o Rims and Tires  ",null,null,null,null,null,8315,8949.85,null,0]
[]
[0,null,133608,"13,200 lb. Tag Axle w/Aluminum Rims and Tires ",null,null,null,null,null,11678,12569.62,null,0]
[0,null,133609,"13,200 lb. Tag Axle w/Steel Rims and Tires ",null,null,null,null,null,10612,11422.23,null,0]
[0,null,133610,"13,200 lb. Tag Axle w/o Rims and Tires ",null,null,null,null,null,9125,9821.69,null,{"$f":"+K85*A85","v":0}]
[]
[0,null,133611,"13,200 lb. Steerable Tag w/Aluminum Rims and Tires                             ",null,null,null,null,null,12779,13754.68,null,0]
[0,null,133612,"13,200 lb. Steerable Tag w/Steel Rims and Tires                              ",null,null,null,null,null,11713,12607.29,null,0]
[0,null,133613,"13,200 lb. Steerable Tag w/o Rims and Tires                              ",null,null,null,null,null,10226,11006.76,null,{"$f":"+K89*A89","v":0}]
[{"$f":"SUM(A76:B89)","v":0},null,null,"**Consult Factory For CT/WB Requirements**",null,null,null,null,null,null,null,null,0]
["Quantity",null,null,"Lighting Options - AIR",null,null,null,null,null,null,"Retail Price",null,"Total Price"]
["STD",null,null,"LED Body Lights including Reverse and License Plate",null,null,null,null,null,0,381.03]
[0,null,114995,"LED Backup Lights - mounted mid body (2 Lights)",null,null,null,null,null,354,381.03,null,{"$f":"+K93*A93","v":0}]
[0,null,131376,"LED High Intensity Backup Lights - mounted on tailgate (2 Lights)",null,null,null,null,null,409,440.23,null,0]
[0,null,118750,"LED High Intensity Work Lights (2 Lights in Hopper and 1 on Canopy)",null,null,null,null,null,354,381.03,null,0]
[0,null,133389,"LED Work Lights Mounted on Canopy Directed Toward Can (2 Lights)",null,null,null,null,null,439,472.52,null,0]
[0,null,118816,"Strobe Light Beacon (Surface Mount)",null,null,null,null,null,352,378.88,null,{"$f":"+K97*A97","v":0}]
[null,null,null,"Location--->",null,"Center Tailgate (standard location - edit if other location required)"]
[0,null,131961,"Strobe Light Package (Integrated Strobe System with Turn Signals - 2 round lights mounted in upper tailgate)",null,null,null,null,null,420,452.07,null,{"$f":"+K99*A99","v":0}]
[0,null,131380,"Strobe Light Package (Integrated Strobe System with Turn Signals - 2 round lights mounted in lower tailgate)",null,null,null,null,null,420,452.07,null,0]
[0,null,136781,"LED Round Strobes - 2 lights mounted in upper tailgate",null,null,null,null,null,420,452.07,null,0]
[0,null,131382,"LED Oval Strobes - 2 lights mounted in upper tailgate",null,null,null,null,null,454,488.66,null,0]
[0,null,131383,"LED Oval Strobes - 2 lights mounted in lower tailgate",null,null,null,null,null,454,488.66,null,0]
[0,null,134310,"Upper Light Bar - 2 Stop/Tail lights & 2 Turn Signal lights",null,null,null,null,null,582,463.5,null,0]
[0,null,130440,"Traffic Advisor Board (mounted mid tailgate)",null,null,null,null,null,858,923.51,null,0]
["STD",null,null,"Center Mount Brake (I.D. Cluster)",null,null,null,null,null,0,{"$f":"$E$40/100*J106","v":0}]
[0,null,130209,"Brush Guards For Upper Tailgate Light Bar (protects up to 4 lights)",null,null,null,null,null,181,194.82,null,0]
[0,null,136826,"Wiring Circuit Including switch for customer installed lights (includes switch in cab and 16 ga. wire to designated location)",null,null,null,null,null,170,182.98,null,0]
[null,null,null,"Light Location--->"]
[null,null,null,"Custom Lighting Packages: Consult your RSM for pricing and note in \"Special Instructions\" at bottom",null,null,null,null,null,null,"Consult Factory"]
["Quantity",null,null,"Safety Device Options-AIR",null,null,null,null,null,null,"Retail Price",null,"Total Price"]
[null,null,115670,"Back-up Alarm Upgrade (102 db)",null,null,null,null,null,80,86.11,null,{"$f":"+K112*A112","v":0}]
[null,null,135197,"Back-up Alarm Auto Volume Adjustable (87 - 112 db)",null,null,null,null,null,157,168.99,null,{"$f":"+K113*A113","v":0}]
["STD",null,null,"Over Height Warning Light - Provides visual alert when arms/forks are above cab",null,null,null,null,null,0,{"$f":"$E$40/100*J114","v":0}]
[null,null,119518,"Over Height Warning Buzzer - Provides audible alert when arms/forks are above cab",null,null,null,null,null,189,203.43,null,{"$f":"+K115*A115","v":0}]
[null,null,null,"Back Up Collision Avoidance Sensor - Safety Vision camera system",null,null,null,null,null,743,799.73,null,{"$f":"+K116*A116","v":0}]
[null,null,null,"Back Up Collision Avoidance Sensor - 3rd Eye camera system",null,null,null,null,null,1221,1314.22,null,{"$f":"+K117*A117","v":0}]
["STD",null,133508,"Body Hold-down Lock",null,null,null,null,null,null,0]
[{"$f":"IF(A120>0.5,0,IF(A58>0.5,0,\"STD\"))","v":"STD"},null,113305,"Fire Extinguisher--10lb. (standard equipment on mounted units only)",null,null,null,null,null,0,{"$f":"$E$40/100*J119","v":0}]
[null,null,113724,"Fire Extinguisher--20lb. (upgrade from 10 lb. - available on mounted units only)",null,null,null,null,null,99,109.92,null,{"$f":"+K120*A120","v":0}]
[null,null,116227,"Triangle Kit (standard equipment and only available on mounted units)",null,null,null,null,null,0,0]
[null,null,113426,"Caution Decal for Tailgate (Large)",null,null,null,null,null,270,290.61,null,{"$f":"+K122*A122","v":0}]
[null,null,128553,"Transition at top of roof from ladder",null,null,null,null,null,864,929.97,null,{"$f":"+K123*A123","v":0}]
[null,null,130550,"Fall Restraint System for Roof",null,null,null,null,null,2916,3138.64,null,{"$f":"+K124*A124","v":0}]
[null,null,126237,"Ladder Down Interlock to Shut Down Hydraulic System",null,null,null,null,null,325,349.81,null,{"$f":"+K125*A125","v":0}]
["Quantity",null,null,"Camera Options-AIR",null,null,null,null,null,null,"Retail Price",null,"Total Price"]
[null,null,null,"Pricing reflects our standard systems with a camera mouted on the center of the tailgate as the first location. Consult your RSM for pricing on specific brands or models and note in Special Instructions section."]
[{"$f":"IF(A131+A134+A137+A140+A143+A146+A149>0.5,0,\"STD\")","v":"STD"},null,134376,"Dual Camera system with 7\" Color Flat Screen Monitor                                                 Center Tailgate location standard - Choose 1 additional location from list below:",null,null,null,null,null,0,{"$f":"$E$40/100*J128","v":0}]
[null,null,null,null,"1st","2nd"]
[null,null,null,null,1]
[null,null,134377,"Triple Camera system with 7\" Color Flat Screen Monitor                                                  Center Tailgate location standard - Choose 2 additional locations from list below:",null,null,null,null,null,658,708.24,null,{"$f":"K131*A131","v":0}]
[null,null,null,null,"1st","2nd","3rd"]
[null,null,null,null,1]
[null,null,134378,"Quad Camera system with 7\" Color Flat Screen Monitor                                                 Center Tailgate location standard - Choose 3 additional locations from list below:",null,null,null,null,null,1151,1238.8800000000001,null,{"$f":"+K134*A134","v":0}]
[null,null,null,null,"1st","2nd","3rd","4th"]
[null,null,null,null,1]
[null,null,136777,"Triple Camera system with 7\" Color Flat Screen Monitor & DVR                                                 Center Tailgate location standard - Choose 2 additional locations from list below:",null,null,null,null,null,2180,2346.44,null,{"$f":"K137*A137","v":0}]
[null,null,null,null,"1st","2nd","3rd"]
[null,null,null,null,1]
[null,null,136778,"Quad Camera system with 7\" Color Flat Screen Monitor & DVR                                                Center Tailgate location standard - Choose 3 additional locations from list below:",null,null,null,null,null,2673,2877.08,null,{"$f":"+K140*A140","v":0}]
[null,null,null,null,"1st","2nd","3rd","4th"]
[null,null,null,null,1]
[null,null,136675,"3rd Eye Dual Camera system with 7\" Color Flat Screen Monitor                                                 Center Tailgate location standard - Choose 1 additional location from list below:",null,null,null,null,null,675,726.54,null,{"$f":"+K143*A143","v":0}]
[null,null,null,null,"1st","2nd"]
[null,null,null,null,1]
[null,null,134010,"3rd Eye Triple Camera system with 7\" Color Flat Screen Monitor                                                  Center Tailgate location standard - Choose 2 additional locations from list below:",null,null,null,null,null,1333,1434.77,null,{"$f":"+K146*A146","v":0}]
[null,null,null,null,"1st","2nd","3rd"]
[null,null,null,null,1]
[null,null,136709,"3rd Eye Quad Camera system with 7\" Color Flat Screen Monitor                                                Center Tailgate location standard - Choose 3 additional locations from list below:",null,null,null,null,null,1991,2143.0100000000002,null,{"$f":"+K149*A149","v":0}]
[null,null,null,null,"1st","2nd","3rd","4th"]
[null,null,null,null,1]
[null,null,null,"Additional Camera Locations"]
[null,null,null,null,null,null,null,1,"Center Tailgate - facing rearward"]
[null,null,null,null,null,null,null,2,"Bulkhead"]
[null,null,null,null,null,null,null,3,"Body - Streetside, facing rearward"]
[null,null,null,null,null,null,null,4,"Midbody - facing into hopper"]
[null,null,null,null,null,null,null,5,"Tailgate - curbside to view alley"]
[null,null,null,null,null,null,null,6,"Dash - facing forward"]
[null,null,null,null,null,null,null,7,"Dash - facing driver"]
[null,null,null,null,null,null,null,99,"Other - describe in Special Instructions section"]
["Quantity",null,null,"Paint Options-AIR",null,null,null,null,null,null,"Retail Price",null,"Total Price"]
[null,null,null,"Two Tone, Custom Paint or Special Designs (Mounted Units Only - Must submit design drawing with this form including detailed dimensions, design specifics, logos and paint codes)  Contact your RSM for pricing and note in \"Special Instructions\""]
[null,null,null,"(We Use Axalta Imron Elite)"]
[{"$f":"1-A169","v":1},null,null,"Code:"]
[{"$f":"IF(A166+A167>0.5,0,\"STD\")","v":"STD"},null,133588,"Acrylic Urethane Enamel (White) - MUST ENTER PAINT CODE ABOVE",null,null,null,null,null,0,{"$f":"$E$40/100*J165","v":0}]
[null,null,136964,"Acrylic Urethane Enamel Color Coat - MUST ENTER COLOR & CODE ABOVE",null,null,null,null,null,1609,1731.85,null,{"$f":"+K166*A166","v":0}]
[null,null,110157,"Two Tone Or Special Design (Mounted Units Only)",null,null,null,null,null,null,"Consult Factory"]
[0,null,133568,"Clear Coat",null,null,null,null,null,2231,2401.34,null,{"$f":"+K168*A168","v":0}]
[0,null,133600,"Prime Inside Body (Recommended for Stock Units)",null,null,null,null,null,567,610.29,null,{"$f":"+K169*A169","v":0}]
[0,null,119124,"Body Undercoating/Bedliner (Mounted Units only - applied from frame rails to edge of hopper and body)",null,null,null,null,null,3270,3519.66,null,{"$f":"+K170*A170","v":0}]
[0,null,136776,"Body Undercoating/Bedliner (Mounted Units only - applied from frame rails to edge of body.  Does not include bottom of hopper)",null,null,null,null,null,2180,2346.44,null,0]
[0,null,136186,"Body Undercoating/Bedliner Applied to Canopy/Cab Cover",null,null,null,null,null,530,570.47,null,{"$f":"+K172*A172","v":0}]
["Quantity",null,null,"Steel Options-AIR",null,null,null,null,null,null,"Retail Price",null,"Total Price"]
[{"$f":"IF(A175+A176>0.5,0,\"STD\")","v":"STD"},null,null,"Body Roof to 12GA 80K",null,null,null,null,null,0,{"$f":"$E$40/100*J174","v":0}]
[0,null,{"$f":"IF(A$51>0.5,130733,130544)","v":130544},"Body Roof to 10GA 80K-40YD (130733-34YD)",null,null,null,null,null,180,193.74,null,{"$f":"+K175*A175","v":0}]
[0,null,{"$f":"IF(A$51>0.5,132999,133000)","v":133000},"Body Roof to 1/8\" AR450-40YD (132999-34YD)",null,null,null,null,null,800,861.08,null,0]
[]
[{"$f":"IF(A179>0.5,0,\"STD\")","v":"STD"},null,null,"Roof Door Expanded Metal",null,null,null,null,null,0,{"$f":"$E$40/100*J178","v":0}]
[0,null,130545,"Roof Door Solid Metal 14GA",null,null,null,null,null,0,{"$f":"$E$40/100*J179","v":0},null,{"$f":"+K179*A179","v":0}]
[]
[{"$f":"IF(A182>0.5,0,\"STD\")","v":"STD"},null,null,"Body Sides 1/8\" AR 450",null,null,null,null,null,0,{"$f":"$E$40/100*J181","v":0}]
[0,null,130528,"Body Sides 3/16\" AR450-40YD (132413-34YD)",null,null,null,null,null,1289,1387.42,null,{"$f":"+K182*A182","v":0}]
[]
[{"$f":"IF(A185+A186>0.5,0,\"STD\")","v":"STD"},null,null,"Body Floor 1/8\" AR450",null,null,null,null,null,0,{"$f":"$E$40/100*J184","v":0}]
[0,null,{"$f":"IF(A$51>0.5,131713,130201)","v":130201},"Body Floor 3/16\" AR235-40YD (131713-34YD)",null,null,null,null,null,215,231.42,null,{"$f":"+K185*A185","v":0}]
[0,null,{"$f":"IF(A$51>0.5,132997,132998)","v":132998},"Body Floor to 3/16\" AR450-40YD (132997-34YD)",null,null,null,null,null,1091,1174.3,null,{"$f":"+K186*A186","v":0}]
[0,null,131448,"Body Floor Liner 36\" Into Body 3/16\" AR450",null,null,null,null,null,645,694.25,null,{"$f":"+K187*A187","v":0}]
[0,null,{"$f":"IF(A$51>0.5,132995,130017)","v":130017},"Body Floor Liner 3/16\" AR450-40YD (132995-34YD)",null,null,null,null,null,1934,2081.66,null,{"$f":"+K188*A188","v":0}]
[]
[{"$f":"IF(A191>0.5,0,\"STD\")","v":"STD"},null,null,"Hopper Sides 3/16\" AR450",null,null,null,null,null,0,{"$f":"$E$40/100*J190","v":0}]
[0,null,130203,"Hopper Sides 1/4\" AR450",null,null,null,null,null,1044,1123.71,null,{"$f":"+K191*A191","v":0}]
[]
[{"$f":"IF(A194>0.5,0,\"STD\")","v":"STD"},null,null,"Hopper Floor 3/16\" AR450",null,null,null,null,null,0,{"$f":"$E$40/100*J193","v":0}]
[0,null,129924,"Hopper Floor 1/4\" AR450",null,null,null,null,null,537,578,null,{"$f":"+K194*A194","v":0}]
[]
[{"$f":"IF(A197>0.5,0,\"STD\")","v":"STD"},null,128255,"Front Sump w/ Dual Clean Out Doors",null,null,null,null,null,0,{"$f":"$E$40/100*J196","v":0}]
[0,null,132681,"No Hopper Cleanouts (Deduct)",null,null,null,null,null,-584,-628.59,null,{"$f":"+K197*A197","v":0}]
[]
[{"$f":"IF(A200>0.5,0,\"STD\")","v":"STD"},null,null,"Tailgate Bubble 1/8\" AR450",null,null,null,null,null,0,{"$f":"$E$40/100*J199","v":0}]
[0,null,130974,"Tailgate Bubble 3/16\" AR450",null,null,null,null,null,644,693.17,null,{"$f":"+K200*A200","v":0}]
[]
[{"$f":"IF(A203>0.5,0,\"STD\")","v":"STD"},null,null,"Packer Panel Lower Face 3/16\" AR450",null,null,null,null,null,0,{"$f":"$E$40/100*J202","v":0}]
[0,null,130525,"Packer Panel Lower Face Liner 3/16\" AR450",null,null,null,null,null,644,693.17,null,{"$f":"+K203*A203","v":0}]
[{"$f":"IF(A205>0.5,0,\"STD\")","v":"STD"},null,null,"Packer Panel Sloped Face 3/16\" AR450",null,null,null,null,null,0,{"$f":"$E$40/100*J204","v":0}]
[0,null,130526,"Packer Panel Sloped Face & Lower Liners 3/16\" AR450",null,null,null,null,null,1095,1178.5999999999999,null,{"$f":"+K205*A205","v":0}]
[0,null,136782,"Super Track Bottom Wear Strip (Hopper Only)",null,null,null,null,null,2271,2444.39,null,0]
[0,null," "," ",null,null,null,null,null,0,{"$f":"$E$40/100*J207","v":0},null,0]
[0,null,130212,"Ejection Panel Liner Construction Grade 3/16 AR450",null,null,null,null,null,1032.48,1111.31,null,0]
[0,null," "," ",null,null,null,null,null,0,{"$f":"$E$40/100*J209","v":0},null,{"$f":"+K209*A209","v":0}]
[null,null,127681,"Aluminum Canopy (short extension)",null,null,null,null,null,0,{"$f":"$E$40/100*J210","v":0}]
[{"$f":"IF(A212+A213+A215+A216>0.5,0,\"STD\")","v":"STD"},null,127682,"Aluminum Canopy (long extension)",null,null,null,null,null,0,{"$f":"$E$40/100*J211","v":0}]
[0,null,132153,"Aluminum Canopy With Air Cylinder Extension",null,null,null,null,null,1296,1394.95,null,0]
[0,null,133999,"Steel Canopy With Steel Extension that is Air Raised",null,null,null,null,null,774,833.09,null,{"$f":"+K213*A213","v":0}]
[0,null,127683,"Steel Canopy (short extension)",null,null,null,null,null,0,{"$f":"$E$40/100*J214","v":0},null,0]
[0,null,127684,"Steel Canopy (long extension)",null,null,null,null,null,0,{"$f":"$E$40/100*J215","v":0},null,0]
[0,null,136780,"Torque Tube Reinforcement Inserts",null,null,null,null,null,181,194.82,null,{"$f":"+K216*A216","v":0}]
[null,null,null,"Custom Steel Packages: Consult your RSM for pricing and note in \"Special Instructions\" at bottom",null,null,null,null,null,null,"Consult Factory"]
["Quantity",null,null,"Hydraulics-AIR",null,null,null,null,null,null,"Retail Price",null,"Total Price"]
["STD",null,null,"Filter By-Pass Visual Indicator on Filter Housing",null,null,null,null,null,0,{"$f":"$E$40/100*J219","v":0},null,0]
[0,null,120152,"Filter By-Pass Visual Indicator In Cab",null,null,null,null,null,252,271.24,null,{"$f":"+K220*A220","v":0}]
[0,null,132266,"High Temperature Fluid Switch Visual Indicator in Cab",null,null,null,null,null,495,532.79,null,{"$f":"+K221*A221","v":0}]
[0,null,132267,"Low Fluid Level Switch Visual Indicator in Cab",null,null,null,null,null,495,532.79,null,{"$f":"+K222*A222","v":0}]
[0,null,104231,"Hydraulic Shut Down When One or More of the Following Condtitions Exist:  Filter By-Pass, High Temperature Fluid and/or Low Fluid Level (NOTE: REQUIRES VISUAL INDICATOR IN CAB FOR EACH INPUT) ",null,null,null,null,null,528,568.30999999999995,null,{"$f":"+K223*A223","v":0}]
[0,null,104217,"Hour Meter on PTO",null,null,null,null,null,268,288.45999999999998,null,0]
[0,null,115506,"In Tank Oil Heater (120 Volt w/plug in)",null,null,null,null,null,1408,1515.5,null,0]
["STD",null,null,"Aluminum Oil Tank With In Tank Filtration",null,null,null,null,null,0,{"$f":"$E$40/100*J226","v":0}]
[0,null,127714,"High Pressure Schroeder Filter",null,null,null,null,null,1451,1561.78,null,{"$f":"+K227*A227","v":0}]
["STD",null,null,"Quick Disconnect Port for Pressure Gage",null,null,null,null,null,0,{"$f":"$E$40/100*J228","v":0},null,0]
[0,null,124738,"Quick Disconnect Pressure Gage",null,null,null,null,null,96,106.34,null,{"$f":"+K229*A229","v":0}]
[null,null,null,"Custom Hydraulic Packages:  Consult your RSM for pricing and note in \"Special Instructions\" at bottom",null,null,null,null,null,null,"Consult Factory"]
["Quantity",null,null,"Fork and Arm Options-AIR",null,null,null,null,null,null,"Retail Price",null,"Total Price"]
[{"$f":"IF(A233>0.5,0,\"STD\")","v":"STD"},null,133466,"Dual Lever Control Joystick",null,null,null,null,null,0,{"$f":"$E$40/100*J232","v":0}]
[0,null,133465,"Single Handle Quad Control Joystick",null,null,null,null,null,0,{"$f":"$E$40/100*J233","v":0}]
[]
[{"$f":"IF(A236>0.5,0,\"STD\")","v":"STD"},null,null,"6,000 lb. Lift Rating (STD WC Version) including 4.25\" Arm Cyl. and 3.5\" Fork Cyl.",null,null,null,null,null,0,{"$f":"$E$40/100*J235","v":0}]
[0,null,132954,"8,000 lb. Lift Rating on WC Body including 4.5\" Arm Cyl. and 3.5\" Fork Cyl.",null,null,null,null,null,459,494.04,null,{"$f":"+K236*A236","v":0}]
[]
[{"$f":"IF(A239+A241+A242+A243+A244+A245+A247+A248+A249+A250+A251+A253+A254+A255+A257+A258+A259>0.5,0,\"STD\")","v":"STD"},null,129844,"Fork Thickness 1\" 100K smooth no hook (48\" usable bumper to tip)",null,null,null,null,null,0,{"$f":"$E$40/100*J238","v":0}]
[0,null,129531,"Fork Thickness 1\" 100K with hook (44\" usable bumper to tip)",null,null,null,null,null,0,{"$f":"$E$40/100*J239","v":0}]
[]
[0,null,110122,"Fork Thickness 1 1/4\" 100K with hook (44\" usable bumper to hook)",null,null,null,null,null,134,144.22999999999999,null,{"$f":"+K241*A241","v":0}]
[0,null,112140,"Fork Thickness 1 1/4\" 100K smooth no hook (48\" usable bumper to tip)",null,null,null,null,null,134,144.22999999999999,null,{"$f":"+K242*A242","v":0}]
[0,null,121901,"Fork Thickness 1 1/4\" 100K with hook (48\" usable bumper to hook)",null,null,null,null,null,318,342.28,null,{"$f":"+K243*A243","v":0}]
[0,null,125087,"Fork Thickness 1 1/4\" 100K with hook (58-1/2\" usable bumper to hook)",null,null,null,null,null,520,559.70000000000005,null,{"$f":"+K244*A244","v":0}]
[0,null,125085,"Fork Thickness 1 1/4\" 100K with hook (66\" usable bumper to hook)",null,null,null,null,null,812,874,null,{"$f":"+K245*A245","v":0}]
[]
[null,null,108746,"Fork Thickness 1 1/2\" 100K with hook (44\" usable bumper to hook)",null,null,null,null,null,526,566.16,null,0]
[null,null,121843,"Fork Thickness 1 1/2\" 100K with hook (48\" usable bumper to hook)",null,null,null,null,null,620,667.34,null,0]
[null,null,125084,"Fork Thickness 1 1/2\" 100K with hook (58\" usable bumper to hook)",null,null,null,null,null,855,920.28,null,0]
[null,null,120162,"Fork Thickness 1 1/2\" 100K with hook (61\" usable bumper to hook)",null,null,null,null,null,925,995.62,null,0]
[null,null,124649,"Fork Thickness 1 1/2\" 100K with hook (66\" usable bumper to hook)",null,null,null,null,null,1043,1122.6300000000001,null,0]
[]
[null,null,125082,"Fork Thickness 1 1/2\" 100K smooth no hook (48\" usable bumper to tip)",null,null,null,null,null,620,667.34,null,0]
[null,null,130055,"Fork Thickness 1 1/2\" 100K smooth no hook (58-1/2\" usable bumper to tip)",null,null,null,null,null,855,920.28,null,0]
[null,null,109306,"Fork Thickness 1 1/2\" 100K smooth no hook (65\" usable bumper to tip)",null,null,null,null,null,1043,1122.6300000000001,null,0]
[]
[null,null,132061,"Fork Width Adjustment Hydraulic (both sides  22\" ea) 51\" Usable Smooth 1 1/2\"",null,null,null,null,null,3028,3259.19,null,{"$f":"+K257*A257","v":0}]
[0,null,132858,"Fork Width Adjustment Hydraulic (both sides  22\" ea) 47\" Usable Hook",null,null,null,null,null,2934,3158.01,null,0]
[0,null,131864,"Fork Width Adjustment Hydraulic (both sides  22\" ea) Bottom Pocket Forks",null,null,null,null,null,2934,3158.01,null,0]
[]
[0,null,118855,"Fork Limiter to retain can on forks during dumping",null,null,null,null,null,189,203.43,null,0]
[0,null,130177,"Fork Cylinders Upgrade - Increase from 3.5\" to 4\" Diameter",null,null,null,null,null,345,371.34,null,0]
[]
[null,null,null,"Residential Package Options - AIR"]
[null,null,null," Note: Auto Dump and Self Level NOT Available on Air Models.                                You must select CANBUS for Auto Dump and Self Level Options."]
[0,null,110155,"Outside Controls For Arms, Forks, Packing w/ E- Stop",null,null,null,null,null,1335,1436.93,null,{"$f":"+K266*A266","v":0}]
[0,null,110151,"Curbside In Cab Arm/Fork Controls",null,null,null,null,null,1129,1215.2,null,0]
[0,null,131628,"Deceleration On Arms Down Function",null,null,null,null,null,1031,1109.72,null,0]
[0,null,130546,"Cradle Support for Arms Down",null,null,null,null,null,482,518.79999999999995,null,{"$f":"+K269*A269","v":0}]
[0,null,130551,"Curotto Can Ready with Controls, Plumbing to Quick Disconnects at Fork Pivot, Harnesses, Cradle to Support Arms Down and Deceleration Arms Down\n(With Out Automated Arm and Can)                                                                                 Note: Auto Dump NOT Available on AIR System",null,null,null,null,null,13855,14912.83,null,{"$f":"+K270*A270","v":0}]
[0,null,132218,"Complete Residential Package Including: Residential Carry Can w/tipper fork cradle (includes curbside in cab arm/fork controls)",null,null,null,null,null,10935,11769.89,null,{"$f":"+K271*A271","v":0}]
[0,null,131468,"Plumb Only For Residential Container (Includes Tap-In and Plumbing to front forks)",null,null,null,null,null,1809,1947.12,null,{"$f":"+K272*A272","v":0}]
[null,null,null,"Custom Arm/Fork Options:  Consult your RSM for pricing and note in \"Special Instructions\" at bottom",null,null,null,null,null,null,"Consult Factory"]
["Quantity",null,null,"Accessories - AIR",null,null,null,null,null,null,"Retail Price",null,"Total Price"]
[0,null,130571,"Shovel/Broom Rack",null,null,null,null,null,197,212.04,null,{"$f":"+K275*A275","v":0}]
[null,null,null,"Location:","Back side of front bulkhead screen"]
[0,null,130175,"Extending cleaning tool with broom attachment and holder",null,null,null,null,null,285,306.76,null,{"$f":"+K277*A277","v":0}]
[0,null,104252,"Steel Tool Box 18x18x24 (must confirm space available to mount)",null,null,null,null,null,526,566.16,null,0]
[0,null,104253,"Steel Tool Box 18x18x36 (must confirm space available to mount)",null,null,null,null,null,615,661.96,null,0]
[0,null,104254,"Steel Tool Box 18x18x48 (must confirm space available to mount)",null,null,null,null,null,674,725.46,null,0]
[0,null,115378,"Container Washout Tank Air 35 Gallon (must confirm space available to mount)",null,null,null,null,null,1566,1685.56,null,0]
[0,null,113771,"Container Washout Tank Air 50Gallon (must confirm space available to mount)",null,null,null,null,null,1691,1820.11,null,0]
[0,null,129862,"Container Disinfectant Tank Elec. 50 Gallon (must confirm space available to mount)",null,null,null,null,null,2394,2576.7800000000002,null,0]
[0,null,114463,"Auto Lube (Up to 20 Points)",null,null,null,null,null,6038,6499,null,0]
[0,null,131218,"Remote Grease tailgate hinge & cylinders",null,null,null,null,null,378,406.86,null,0]
[{"$f":"IF(A287+A288>0.5,0,\"STD\")","v":"STD"},null,120908,"Sliding Access Door (Fiber Glass)",null,null,null,null,null,0,{"$f":"$E$40/100*J286","v":0}]
[0,null,123701,"Sliding Access Door (Steel)",null,null,null,null,null,414,445.61,null,{"$f":"+K287*A287","v":0}]
[0,null,130487,"Dual Access Door",null,null,null,null,null,526,566.16,null,0]
[0,null,130304,"Rubber Fender Skirt Extension (Required for rear tires wider than 98.5\")-40YD\n(130734-34YD)",null,null,null,null,null,270,290.61,null,0]
[0,null,129845,"National Standard Fire Hose Port",null,null,null,null,null,1296,1394.95,null,0]
[0,null,130176,"Aluminum Drip Pan Below Tailgate Seal (135871-Autocar 4-axle)",null,null,null,null,null,729,784.66,null,0]
[0,null,128856,"Upper Tailgate Seal Extension Rubber (Std. 36\" + Additional 36\" Drip Guard)",null,null,null,null,null,596,641.5,null,0]
[null,null,null,"Custom Accessories:  Consult your RSM for pricing and note in \"Special Instructions\" at bottom",null,null,null,null,null,null,"Consult Factory"]
["Quantity",null,null,"Warranty Options- Air",null,null,null,null,null,null,"Retail Price",null,"Total Price"]
["stay",null,null,"All Warranties Are Conditional--Refer To Warranty Statement"]
[]
[{"$f":"IF(A298+A299+A300>0.5,0,\"STD\")","v":"STD"},null,null,"2-Year Cylinder Warranty",null,null,null,null,null,0,{"$f":"'STD Frontloader CANBUS'!$E$40/100*J297","v":0}]
[null,null,119324,"3-Year Cylinder Warranty",null,null,null,null,null,1835,1975.1,null,{"$f":"+K298*A298","v":0}]
[null,null,119325,"4-Year Cylinder Warranty",null,null,null,null,null,4171,4489.46,null,{"$f":"+K299*A299","v":0}]
[null,null,119326,"5-Year Cylinder Warranty",null,null,null,null,null,5283,5686.36,null,{"$f":"+K300*A300","v":0}]
[]
[{"$f":"IF(A303+A304+A305+A306>0.5,0,\"STD\")","v":"STD"},null,119327,"1-Year Body Warranty",null,null,null,null,null,0,{"$f":"$E$40/100*J302","v":0}]
[0,null,119328,"2-Year Body Warranty",null,null,null,null,null,1285,1383.11,null,{"$f":"+K303*A303","v":0}]
[0,null,121178,"3-Year Body Warranty",null,null,null,null,null,2570,2766.22,null,{"$f":"+K304*A304","v":0}]
[0,null,130547,"4-Year Body Warranty",null,null,null,null,null,3856,4150.41,null,{"$f":"+K305*A305","v":0}]
[0,null,124531,"5-Year Body Warranty",null,null,null,null,null,5044,5429.11,null,{"$f":"+K306*A306","v":0}]
[null,null,null,null,null,null,null,null,null,null,null,null,{"$f":"+K307*A307","v":0}]
[{"$f":"IF(A309+A310+A311+A312>0.5,0,\"STD\")","v":"STD"},null,116572,"1-Year Hydraulic Warranty",null,null,null,null,null,0,{"$f":"$E$40/100*J308","v":0}]
[0,null,119329,"2-Year Hydraulic Warranty",null,null,null,null,null,1604,1726.47,null,{"$f":"+K309*A309","v":0}]
[0,null,119330,"3-Year Hydraulic Warranty",null,null,null,null,null,2403,2586.4699999999998,null,{"$f":"+K310*A310","v":0}]
[0,null,119345,"4-Year Hydraulic Warranty (Excludes Cylinders)",null,null,null,null,null,3242,3489.53,null,{"$f":"+K311*A311","v":0}]
[0,null,119331,"5-Year Hydraulic Warranty (Excludes Cylinders)",null,null,null,null,null,4080,4391.51,null,{"$f":"+K312*A312","v":0}]
[0]
[0,null,null,"Note: All Extended Hydraulic/Cylinder Warranties include a spare set of \nreplacment filters and breather",null,null,null,null,null,null,null,null,{"$f":"+K314*A314","v":0}]
["Special Instructions (Consult Factory for Pricing)"]
["Quantity",null,"Instruction",null,null,null,null,null,null,null,"Retail Price",null,"Total Price"]
[null,null,null,null,null,null,null,null,null,null,null,null,{"$f":"+K317*A317","v":0}]
[null,null,null,null,null,null,null,null,null,null,null,null,0]
[null,null,null,null,null,null,null,null,null,null,null,null,0]
[null,null,null,null,null,null,null,null,null,null,null,null,0]
[null,null,null,null,null,null,null,null,null,null,null,null,0]
[null,null,null,null,null,null,null,null,null,null,null,null,0]
[null,null,null,null,null,null,null,null,null,null,null,null,0]
[null,null,null,null,null,null,null,null,null,null,null,null,0]
[null,null,null,null,null,null,null,null,null,null,null,null,0]
[null,null,null,null,null,null,null,null,null,null,null,null,0]
[null,null,null,null,null,null,null,null,null,null,null,null,0]
[null,null,null,null,null,null,null,null,null,null,null,null,0]
[null,null,null,null,null,null,null,null,null,null,null,null,0]
[null,null,null,"IF ANY ADDITIONAL ROWS ARE ADDED, CONFIRM $ VALUES ARE ADDED TO THE TOTAL"]
[null,null,null,"BELOW - LIST BREIF SUMMARY OF DELIVERY REQUEST"]

{"sheet":"STD Frontloader CANBUS","index":2,"n_rows":326,"n_cols":18,"rows_kept":326,"cut":false,"hidden":false,"merged":[[204,10,204,11],[204,12,204,14],[192,0,192,1],[192,10,192,11],[197,0,197,1],[197,3,197,8],[197,10,197,11],[197,12,197,14],[174,0,174,1],[174,3,174,8],[174,10,174,11],[174,12,174,14],[175,0,175,1],[175,3,175,8],[175,10,175,11],[208,10,208,11],[212,0,212,1],[212,3,212,8],[212,12,212,14],[212,10,212,11],[208,12,208,14],[206,3,206,8],[206,10,206,11],[220,12,220,14],[209,3,209,8],[209,10,209,11],[209,12,209,14],[210,0,210,1],[210,3,210,8],[210,10,210,11],[161,10,161,11],[161,0,161,1],[181,12,181,14],[187,12,187,14],[190,12,190,14],[193,12,193,14],[196,12,196,14],[199,12,199,14],[176,0,176,1],[178,0,178,1],[181,0,181,1],[203,0,203,1],[203,3,203,8],[203,10,203,11],[203,12,203,14],[204,0,204,1],[204,3,204,8],[307,0,307,1],[307,3,307,8],[307,10,307,11],[307,12,307,14],[308,0,308,1],[308,3,308,8],[308,10,308,11],[308,12,308,14],[300,0,300,1],[300,3,300,8],[300,10,300,11],[300,12,300,14],[301,0,301,1],[301,3,301,8],[301,10,301,11],[301,12,301,14],[302,0,302,1],[302,3,302,8],[302,10,302,11],[302,12,302,14],[303,0,303,1],[303,3,303,8],[303,10,303,11],[303,12,303,14],[305,0,305,1],[305,3,305,8],[305,10,305,11],[305,12,305,14],[306,0,306,1],[306,3,306,8],[306,10,306,11],[306,12,306,14],[293,12,293,14],[294,0,294,1],[294,3,294,8],[294,10,294,11],[294,12,294,14],[292,12,292,14],[304,0,304,1],[304,3,304,8],[304,10,304,11],[304,12,304,14],[295,0,295,1],[295,3,295,8],[295,10,295,11],[295,12,295,14],[296,0,296,1],[296,3,296,8],[296,10,296,11],[298,0,298,1],[298,3,298,8],[298,10,298,11],[298,12,298,14],[299,0,299,1],[299,3,299,8],[299,10,299,11],[299,12,299,14],[241,0,241,1],[243,0,243,1],[222,12,222,14],[224,3,224,8],[229,3,229,8],[226,12,226,14],[226,3,226,8],[226,10,226,11],[272,10,272,11],[272,12,272,14],[273,12,273,14],[274,12,274,14],[281,10,281,11],[282,10,282,11],[285,0,285,1],[285,10,285,11],[243,3,243,8],[224,12,224,14],[234,10,234,11],[289,0,289,1],[289,3,289,8],[289,10,289,11],[289,12,289,14],[290,0,290,1],[217,12,217,14],[198,0,198,1],[198,12,198,14],[200,12,200,14],[201,0,201,1],[201,3,201,8],[201,10,201,11],[201,12,201,14],[202,0,202,1],[202,3,202,8],[202,10,202,11],[202,12,202,14],[200,0,200,1],[200,3,200,8],[200,10,200,11],[209,0,209,1],[296,12,296,14],[290,3,290,8],[290,10,290,11],[213,0,213,1],[213,3,213,8],[213,10,213,11],[214,0,214,1],[206,0,206,1],[243,10,243,11],[243,12,243,14],[211,0,211,1],[211,3,211,8],[211,10,211,11],[205,12,205,14],[207,0,207,1],[207,3,207,8],[211,12,211,14],[188,0,188,1],[188,3,188,8],[188,10,188,11],[188,12,188,14],[183,3,183,8],[189,0,189,1],[189,3,189,8],[189,10,189,11],[189,12,189,14],[191,0,191,1],[191,10,191,11],[191,12,191,14],[183,12,183,14],[184,0,184,1],[184,3,184,8],[192,12,192,14],[194,0,194,1],[194,3,194,8],[194,10,194,11],[194,12,194,14],[183,10,183,11],[186,0,186,1],[195,0,195,1],[195,3,195,8],[195,10,195,11],[195,12,195,14],[191,3,191,8],[207,10,207,11],[207,12,207,14],[208,0,208,1],[208,3,208,8],[177,12,177,14],[179,0,179,1],[179,3,179,8],[179,10,179,11],[179,12,179,14],[176,12,176,14],[178,12,178,14],[288,3,288,8],[287,10,287,11],[245,3,245,8],[245,10,245,11],[245,12,245,14],[264,3,264,8],[264,10,264,11],[264,12,264,14],[280,12,280,14],[281,12,281,14],[279,12,279,14],[283,10,283,11],[283,12,283,14],[285,3,285,8],[272,3,272,8],[184,12,184,14],[255,0,255,1],[248,0,248,1],[288,0,288,1],[283,0,283,1],[286,10,286,11],[210,12,210,14],[205,0,205,1],[205,3,205,8],[205,10,205,11],[314,10,314,11],[311,2,311,8],[255,12,255,14],[269,12,269,14],[290,12,290,14],[216,12,216,14],[220,3,220,8],[221,10,221,11],[215,10,215,11],[168,3,168,8],[167,3,167,8],[228,10,228,11],[180,12,180,14],[182,3,182,8],[182,10,182,11],[182,12,182,14],[229,12,229,14],[227,12,227,14],[225,3,225,8],[225,10,225,11],[228,3,228,8],[216,10,216,11],[186,3,186,8],[186,10,186,11],[186,12,186,14],[173,12,173,14],[185,12,185,14],[213,12,213,14],[184,10,184,11],[175,12,175,14],[177,3,177,8],[177,10,177,11],[167,12,167,14],[214,3,214,8],[214,10,214,11],[214,12,214,14],[206,12,206,14],[198,3,198,8],[198,10,198,11],[57,3,57,8],[60,10,60,11],[56,3,56,8],[59,10,59,11],[50,0,50,1],[51,0,51,1],[52,0,52,1],[53,0,53,1],[55,0,55,1],[49,3,49,8],[49,0,49,1],[59,0,59,1],[57,0,57,1],[51,3,51,8],[55,10,55,11],[54,0,54,1],[73,10,73,11],[79,0,79,1],[79,3,79,8],[62,3,62,8],[62,10,62,11],[62,12,62,14],[70,3,70,8],[55,12,55,14],[57,12,57,14],[39,12,39,14],[54,12,54,14],[60,0,60,1],[60,3,60,8],[58,0,58,1],[50,12,50,14],[51,12,51,14],[52,12,52,14],[43,10,43,11],[43,12,43,14],[39,7,39,11],[47,12,47,14],[33,1,33,3],[33,7,33,10],[33,11,33,13],[90,12,90,14],[90,10,90,11],[90,3,90,8],[55,3,55,8],[54,3,54,8],[68,10,68,11],[56,0,56,1],[82,3,82,8],[82,10,82,11],[76,0,76,1],[82,12,82,14],[83,12,83,14],[63,0,63,1],[60,12,60,14],[59,3,59,8],[56,12,56,14],[54,10,54,11],[2,10,2,13],[95,10,95,11],[74,12,74,14],[74,10,74,11],[58,10,58,11],[58,3,58,8],[0,0,0,14],[14,8,14,11],[15,1,15,4],[15,8,15,11],[16,1,16,3],[16,8,16,10],[16,12,16,13],[17,1,17,3],[20,5,20,13],[21,5,21,13],[22,5,22,8],[22,10,22,11],[23,10,23,11],[25,7,25,8],[25,10,25,13],[9,8,9,11],[9,12,9,13],[8,8,8,13],[2,2,2,5],[4,2,4,5],[7,3,7,6],[16,4,16,6],[34,1,34,3],[40,13,40,14],[44,12,44,14],[31,8,31,13],[172,0,172,1],[48,0,48,1],[53,12,53,14],[2,0,2,1],[7,8,7,13],[31,1,31,3],[12,8,12,13],[13,1,13,6],[13,8,13,13],[14,1,14,4],[17,5,17,6],[17,8,17,10],[24,5,24,6],[24,7,24,8],[24,10,24,13],[25,5,25,6],[31,4,31,6],[50,3,50,8],[41,12,41,14],[48,10,48,11],[29,1,29,3],[29,4,29,6],[29,8,29,13],[47,0,47,1],[120,10,120,11],[70,10,70,11],[71,10,71,11],[71,12,71,14],[73,12,73,14],[110,3,110,8],[47,10,47,11],[2,7,2,9],[185,0,185,1],[185,3,185,8],[185,10,185,11],[82,0,82,1],[222,10,222,11],[215,3,215,8],[11,1,11,6],[11,8,11,13],[12,1,12,6],[17,12,17,13],[10,8,10,10],[10,11,10,13],[4,0,4,1],[4,6,4,8],[4,10,4,13],[34,5,34,6],[40,8,40,12],[40,3,40,4],[40,6,40,7],[36,4,36,6],[39,0,39,2],[53,10,53,11],[52,10,52,11],[53,3,53,8],[51,10,51,11],[7,0,7,2],[48,12,48,14],[49,10,49,11],[50,10,50,11],[56,10,56,11],[49,12,49,14],[57,10,57,11],[59,12,59,14],[218,0,218,1],[217,0,217,1],[120,3,120,8],[88,12,88,14],[89,0,89,1],[84,3,84,8],[84,10,84,11],[84,12,84,14],[87,0,87,1],[182,0,182,1],[172,3,172,8],[180,3,180,8],[180,10,180,11],[183,0,183,1],[172,12,172,14],[160,10,160,11],[171,3,171,8],[172,10,172,11],[95,12,95,14],[94,12,94,14],[123,12,123,14],[124,12,124,14],[117,0,117,1],[117,3,117,8],[117,10,117,11],[119,0,119,1],[119,3,119,8],[119,10,119,11],[120,0,120,1],[121,0,121,1],[121,10,121,11],[215,0,215,1],[234,0,234,1],[233,10,233,11],[232,3,232,8],[232,10,232,11],[116,0,116,1],[218,10,218,11],[116,3,116,8],[116,10,116,11],[130,9,132,9],[130,10,132,11],[139,0,141,1],[139,3,139,8],[139,9,141,9],[139,10,141,11],[145,0,147,1],[145,3,145,8],[145,9,147,9],[145,10,147,11],[180,0,180,1],[133,9,135,9],[173,0,173,1],[173,3,173,8],[118,0,118,1],[118,3,118,8],[118,10,118,11],[148,0,150,1],[148,3,148,8],[167,0,167,1],[167,10,167,11],[127,3,127,8],[312,12,312,14],[313,0,313,1],[313,12,313,14],[316,10,316,11],[312,0,312,1],[314,12,314,14],[316,0,316,1],[312,2,312,8],[313,2,313,8],[314,2,314,8],[315,2,315,8],[316,2,316,8],[317,2,317,8],[228,12,228,14],[240,12,240,14],[233,12,233,14],[221,3,221,8],[221,12,221,14],[223,12,223,14],[274,0,274,1],[227,0,227,1],[227,3,227,8],[227,10,227,11],[240,10,240,11],[230,10,230,11],[235,12,235,14],[230,3,230,8],[230,12,230,14],[222,3,222,8],[273,10,273,11],[315,10,315,11],[315,12,315,14],[33,4,33,6],[90,0,90,1],[95,3,95,8],[94,3,94,8],[95,0,95,1],[74,3,74,8],[74,0,74,1],[52,3,52,8],[47,3,47,8],[48,3,48,8],[273,0,273,1],[278,0,278,1],[282,0,282,1],[247,0,247,1],[247,3,247,8],[277,0,277,1],[281,0,281,1],[276,3,276,8],[73,3,73,8],[274,3,274,8],[280,0,280,1],[279,0,279,1],[277,3,277,8],[280,3,280,8],[278,3,278,8],[281,3,281,8],[279,3,279,8],[160,0,160,1],[142,0,144,1],[121,3,121,8],[177,0,177,1],[230,0,230,1],[27,7,27,13],[61,0,61,1],[61,3,61,8],[61,10,61,11],[61,12,61,14],[62,0,62,1],[88,3,88,8],[88,10,88,11],[83,0,83,1],[83,3,83,8],[83,10,83,11],[91,10,91,11],[92,10,92,11],[93,10,93,11],[76,12,76,14],[58,12,58,14],[66,0,66,1],[66,3,66,8],[79,10,79,11],[79,12,79,14],[72,3,72,8],[84,0,84,1],[67,0,67,1],[67,3,67,8],[70,12,70,14],[71,0,71,1],[68,3,68,8],[68,12,68,14],[68,0,68,1],[75,12,75,14],[75,10,75,11],[76,10,76,11],[69,10,69,11],[69,12,69,14],[70,0,70,1],[76,3,76,8],[75,0,75,1],[72,0,72,1],[87,3,87,8],[87,10,87,11],[87,12,87,14],[63,3,63,8],[63,10,63,11],[63,12,63,14],[64,0,64,1],[64,3,64,8],[64,10,64,11],[64,12,64,14],[65,0,65,1],[65,3,65,8],[65,10,65,11],[65,12,65,14],[67,10,67,11],[67,12,67,14],[78,0,78,1],[78,3,78,8],[78,10,78,11],[78,12,78,14],[73,0,73,1],[66,10,66,11],[66,12,66,14],[80,0,80,1],[80,3,80,8],[80,10,80,11],[71,3,71,8],[80,12,80,14],[86,0,86,1],[86,3,86,8],[86,10,86,11],[86,12,86,14],[88,0,88,1],[96,12,96,14],[97,3,97,4],[97,5,97,8],[98,0,98,1],[98,3,98,8],[98,10,98,11],[98,12,98,14],[89,3,89,8],[89,10,89,11],[89,12,89,14],[91,0,91,1],[91,3,91,8],[91,12,91,14],[77,0,77,1],[77,12,77,14],[75,3,75,8],[72,10,72,11],[72,12,72,14],[69,0,69,1],[69,3,69,8],[99,0,99,1],[99,3,99,8],[99,10,99,11],[99,12,99,14],[92,0,92,1],[92,3,92,8],[93,3,93,8],[94,0,94,1],[96,0,97,1],[96,2,97,2],[96,3,96,8],[96,9,97,9],[96,10,97,11],[94,10,94,11],[92,12,92,14],[93,0,93,1],[93,12,93,14],[103,12,103,14],[104,0,104,1],[104,3,104,8],[104,10,104,11],[104,12,104,14],[105,0,105,1],[105,3,105,8],[105,10,105,11],[105,12,105,14],[100,0,100,1],[100,3,100,8],[100,10,100,11],[100,12,100,14],[101,0,101,1],[101,3,101,8],[101,10,101,11],[101,12,101,14],[102,0,102,1],[102,3,102,8],[102,10,102,11],[102,12,102,14],[103,0,103,1],[103,3,103,8],[103,10,103,11],[109,12,109,14],[111,0,111,1],[111,3,111,8],[111,10,111,11],[111,12,111,14],[112,0,112,1],[112,3,112,8],[112,10,112,11],[112,12,112,14],[106,0,106,1],[106,3,106,8],[106,10,106,11],[106,12,106,14],[107,0,108,1],[107,3,107,8],[107,9,108,9],[107,10,108,11],[107,12,108,14],[108,3,108,4],[108,5,108,8],[110,10,110,11],[110,0,110,1],[109,0,109,1],[109,3,109,8],[109,10,109,11],[110,12,110,14],[113,0,113,1],[113,3,113,8],[113,10,113,11],[113,12,113,14],[114,0,114,1],[114,3,114,8],[114,10,114,11],[114,12,114,14],[115,0,115,1],[115,3,115,8],[115,10,115,11],[115,12,115,14],[139,12,141,14],[136,0,138,1],[136,3,136,8],[136,9,138,9],[136,10,138,11],[136,12,138,14],[116,12,116,14],[117,12,117,14],[118,12,118,14],[119,12,119,14],[120,12,120,14],[121,12,121,14],[130,0,132,1],[123,10,123,11],[124,0,124,1],[124,3,124,8],[124,10,124,11],[123,0,123,1],[123,3,123,8],[130,3,130,8],[148,9,150,9],[148,10,150,11],[148,12,150,14],[142,3,142,8],[142,9,144,9],[142,10,144,11],[142,12,144,14],[133,12,135,14],[122,0,122,1],[122,3,122,8],[122,10,122,11],[122,12,122,14],[127,0,129,1],[127,9,129,9],[127,10,129,11],[127,12,129,14],[125,12,125,14],[133,0,135,1],[130,12,132,14],[133,3,133,8],[125,10,125,11],[125,0,125,1],[133,10,135,11],[125,3,125,8],[168,0,168,1],[168,10,168,11],[168,12,168,14],[169,0,169,1],[169,3,169,8],[169,10,169,11],[169,12,169,14],[145,12,147,14],[164,0,164,1],[164,3,164,8],[164,10,164,11],[164,12,164,14],[165,0,165,1],[165,3,165,8],[165,10,165,11],[165,12,165,14],[162,0,162,1],[157,8,157,11],[158,8,158,11],[159,8,159,11],[162,3,162,8],[162,10,162,11],[162,12,162,14],[163,0,163,1],[163,3,163,4],[163,5,163,8],[163,10,163,11],[163,12,163,14],[160,3,160,8],[160,12,160,14],[161,12,161,14],[161,3,161,8],[170,0,170,1],[170,3,170,8],[170,10,170,11],[170,12,170,14],[171,0,171,1],[171,10,171,11],[171,12,171,14],[229,0,229,1],[232,0,232,1],[240,3,240,8],[224,10,224,11],[217,3,217,8],[217,10,217,11],[215,12,215,14],[235,0,235,1],[239,0,239,1],[233,0,233,1],[240,0,240,1],[235,3,235,8],[236,0,236,1],[238,12,238,14],[232,12,232,14],[239,10,239,11],[225,12,225,14],[228,0,228,1],[239,3,239,8],[234,3,234,8],[236,3,236,8],[173,10,173,11],[219,3,219,8],[229,10,229,11],[220,10,220,11],[216,3,216,8],[225,0,225,1],[223,10,223,11],[235,10,235,11],[247,10,247,11],[247,12,247,14],[249,0,249,1],[249,3,249,8],[249,10,249,11],[249,12,249,14],[250,0,250,1],[250,3,250,8],[250,10,250,11],[250,12,250,14],[244,0,244,1],[244,3,244,8],[244,10,244,11],[244,12,244,14],[245,0,245,1],[216,0,216,1],[238,0,238,1],[226,0,226,1],[242,0,242,1],[246,0,246,1],[246,3,246,8],[246,10,246,11],[224,0,224,1],[218,3,218,8],[218,12,218,14],[219,10,219,11],[221,0,221,1],[219,0,219,1],[253,0,253,1],[253,3,253,8],[253,10,253,11],[253,12,253,14],[219,12,219,14],[223,0,223,1],[252,12,252,14],[220,0,220,1],[222,0,222,1],[223,3,223,8],[233,3,233,8],[238,3,238,8],[238,10,238,11],[239,12,239,14],[234,12,234,14],[236,10,236,11],[236,12,236,14],[241,3,241,8],[241,10,241,11],[241,12,241,14],[246,12,246,14],[251,0,251,1],[251,3,251,8],[251,10,251,11],[251,12,251,14],[252,0,252,1],[252,3,252,8],[242,12,242,14],[248,12,248,14],[258,0,258,1],[258,3,258,8],[258,10,258,11],[258,12,258,14],[259,0,259,1],[259,3,259,8],[259,10,259,11],[259,12,259,14],[260,0,260,1],[260,3,260,8],[260,10,260,11],[260,12,260,14],[254,0,254,1],[254,3,254,8],[254,10,254,11],[254,12,254,14],[256,0,256,1],[256,3,256,8],[256,10,256,11],[256,12,256,14],[257,0,257,1],[257,3,257,8],[257,10,257,11],[257,12,257,14],[261,0,261,1],[261,3,261,8],[261,10,261,11],[261,12,261,14],[262,0,262,1],[262,3,262,8],[262,10,262,11],[262,12,262,14],[263,0,263,1],[263,3,263,8],[263,10,263,11],[263,12,263,14],[268,0,268,1],[268,3,268,8],[268,10,268,11],[268,12,268,14],[269,0,269,1],[266,3,266,8],[266,10,266,11],[266,12,266,14],[264,0,264,1],[265,0,265,1],[265,3,265,8],[265,10,265,11],[265,12,265,14],[267,0,267,1],[323,12,323,14],[324,12,324,14],[319,10,319,11],[319,12,319,14],[324,10,324,11],[317,0,317,1],[317,10,317,11],[317,12,317,14],[316,12,316,14],[314,0,314,1],[312,10,312,11],[267,3,267,8],[267,10,267,11],[267,12,267,14],[269,10,269,11],[269,3,269,8],[266,0,266,1],[284,0,284,1],[276,0,276,1],[275,0,275,1],[275,3,275,8],[282,3,282,8],[283,3,283,8],[284,3,284,8],[282,12,282,14],[285,12,285,14],[287,12,287,14],[277,12,277,14],[284,10,284,11],[284,12,284,14],[278,12,278,14],[274,10,274,11],[311,0,311,1],[311,10,311,11],[311,12,311,14],[291,12,291,14],[292,0,292,1],[292,3,292,8],[292,10,292,11],[293,0,293,1],[293,3,293,8],[293,10,293,11],[318,10,318,11],[318,12,318,14],[319,0,319,1],[325,0,326,1],[325,3,326,8],[325,10,326,11],[325,12,326,14],[320,0,320,1],[320,10,320,11],[320,12,320,14],[322,10,322,11],[324,0,324,1],[324,3,324,8],[323,0,323,1],[318,2,318,8],[319,2,319,8],[320,2,320,8],[321,2,321,8],[322,2,322,8],[323,2,323,8],[322,12,322,14],[323,10,323,11],[291,3,291,8],[291,10,291,11],[270,0,271,1],[270,2,271,2]],"merged_total":1060,"flags":["merged_cut"]}
["New Way Distributor Price Sheet - Mammoth Standard Front Loaders CANBUS"]
[null,null,null,null,null,"July 1st 2019 Pricing Rev 1"]
["Model:",null,null,null,null,null,null,"Requested Ship Date:"]
[null,null,null,null,null,null,null,null,null,null,null,null,null,"Note Penalties If Applicable (Must Be Preapproved)"]
["Date:",null,null,null,null,null,"Purchase Order #:"]
[]
[]
["Distributor Name:",null,null,null,null,null,null,"Contact:"]
[null,null,null,null,null,null,null,null,"Name"]
[]
[null,null,null,null,null,null,null,null,"Email",null,null,"Phone"]
[null,"Bill To:",null,null,null,null,null,null,"Ship To:"]
[]
[null,"Address",null,null,null,null,null,null,"Address"]
[]
[null,"City",null,null,null,"State","Zip",null,"City",null,null,null,"State","Zip"]
[]
[null,"Phone #",null,null,null,"Fax #",null,null,"Phone #",null,null,null,"Fax #"]
[]
[]
["End User Information:"]
[null,null,null,null,null,"Company/Municipal Name"]
[]
[null,null,null,null,null,"Address",null,null,null,null,"City",null,"State","Zip"]
[]
[null,null,null,null,null,"Phone #",null,"Fax #",null,null,"email address"]
[]
["Chassis Dealer:",null,null,null,null,null,"Name:"]
[]
[null,"Chassis Make:",null,null,null,null,null,"Model:"]
[]
[null,"Color:",null,null,null,null,null,"VIN #:"]
[]
[null,null,null,null,null,null,null,"Chassis Frame Height:"]
[null,"Transmission",null,null,null,"Engine"]
[]
[null,null,null,"Chassis Arrival Date:"]
[]
[]
[null,null,null,null,null,null,null,"Total Price",null,null,null,null,{"$f":"SUM(M49:O328)","v":0}]
[null,null,null,{"$f":"IF(D47,5%,0)","v":0},null,null,{"$f":"IF(F47,5%,0)","v":0},null,"Discount Structure (20% Standard) ",null,null,null,null,{"$f":"-(1-0.2)*(1-G41)*(1-D41)+1","v":0.19999999999999996}]
[null,"Stock/Demo Discount must be preapproved",null,null,null,null,null,null,null,null,null,"Grand Total (after discount)",{"$f":"+M40*(1-N41)","v":0}]
[]
[null,"ATD",null,"Percent:",0,"or Dollars",0,null,"Authorization:",null,null,null,{"$f":"IF(E44>0,-E44*M42,IF(G44>0,-G44,0))","v":0}]
[null,"ATD Discount must be preapproved",null,null,null,null,null,null,null,null,null,"Grand Total w/ATD",{"$f":"M42+M44","v":0}]
[]
[null,null,null,false,null,false,null,null," ",null,"July 1st 2019 Pricing Rev 1"]
["Quantity",null,"P/N","Description - CANBUS",null,null,null,null,null,null,"Retail Price",null,"Total"]
["stay",null,null,"Body Size In Cubic Yards"]
[null,null,null,"Standard Full Eject"]
[0,null,9064,"34yd Eject (180-182\" Wheelbase)",null,null,null,null,null,89442,98140.23,null,{"$f":"+A51*K51","v":0}]
[0,null,9061,"40yd Eject  (208\"-210\" Wheelbase)",null,null,null,null,null,90773,99600.67,null,{"$f":"+A52*K52","v":0}]
[0,null,9063,"43yd Eject (208\"-210\" Wheelbase)",null,null,null,null,null,91173,100039.57,null,{"$f":"+A53*K53","v":0}]
[]
[null,null,null,"(All WB's are Exclusive of Tag or Pusher Axles)"]
["Quantity",null,null,"Mounting Options - CANBUS",null,null,null,null,null,null,"Retail Price",null,"Total Price"]
[{"$f":"IF(A58>0.5,0,\"STD\")","v":"STD"},null,null,"Complete Mount (Standard, No Charge)",null,null,null,null,null,0,{"$f":"$E$40/100*J57","v":0}]
[null,null,107465,"Ship Out (Removes Mounting Services & adds a Mounting Kit including hyd. tank, cab console, wire harness and hoses which must be cut to length and crimped by installer.)",null,null,null,null,null,-2014,-2167.77,null,{"$f":"+K58*A58","v":0}]
[null,null,106240,"Service Hoist",null,null,null,null,null,2922,3145.09,null,{"$f":"+K59*A59","v":0}]
[null,null,132983,"CNG Chassis Service Fee (Required for all CNG fueled chassis to cover handling and and prepping unit for transport)",null,null,null,null,null,263,283.08,null,{"$f":"+K60*A60","v":0}]
["Quantity",null,null,"Scale Options - CANBUS",null,null,null,null,null,null,"Retail Price",null,"Total Price"]
[0,null,131234,"Vulcan Scale Installed - Body (6 Point)",null,null,null,null,null,15067,16217.37,null,{"$f":"+K62*A62","v":0}]
[0,null,136774,"Loadman Scale Installed - Body (6 Point)",null,null,null,null,null,14276,15365.97,null,0]
[0,null,132716,"Air Weigh - 3 Axle Scale",null,null,null,null,null,6480,6974.75,null,0]
[0,null,136773,"Air Weigh - 4 Axle Scale",null,null,null,null,null,8100,8718.44,null,0]
[0,null,131970,"Air Weigh Bin Max Arm Scale with Bluetooth Capability",null,null,null,null,null,11750,12647.11,null,0]
[0,null,131703,"Fork Scales - Vulcan R-506",null,null,null,null,null,12455,13405.94,null,0]
[0,null,127286,"Fork/Arm Scale - Loadman LM300",null,null,null,null,null,22994,24749.59,null,0]
["Quantity",null,null,"Pump/PTO Options - CANBUS",null,null,null,null,null,null,"Retail Price",null,"Total Price"]
[{"$f":"IF(A71+A72+A73>0.5,0,\"STD\")","v":"STD"},null,132621,"Front Mount Vane Pump",null,null,null,null,null,0,{"$f":"$E$40/100*J70","v":0}]
[0,null,105963,"Front Mount Muncie MLS Gear Pump (Peterbilt chassis reguires 111 5/8\" arms and bumper extension)",null,null,null,null,null,354.28,381.33,null,{"$f":"+K71*A71","v":0}]
[0,null,null,"Hot Shift PTO Mount Gear Pump",null,null,null,null,null,2580,2776.98,null,{"$f":"+K72*A72","v":0}]
[0,null,null,"Hot Shift PTO Mount Vane Pump",null,null,null,null,null,2780,2992.25,null,{"$f":"+K73*A73","v":0}]
["Quantity",null,null,"Axle Assist Options - CANBUS",null,null,null,null,null,null,"Retail Price",null,"Total Price"]
[0,null,133602,"20,000 lb. Pusher Axle w/Aluminum Rims and Tires (singles only)",null,null,null,null,null,12344,13286.46,null,{"$f":"+K75*A75","v":0}]
[0,null,133603,"20,000 lb. Pusher Axle w/Steel Rims and Tires (singles only)",null,null,null,null,null,11278,12139.08,null,0]
[0,null,133604,"20,000 lb. Pusher Axle w/o Rims and Tires ",null,null,null,null,null,8828,9502.02,null,0]
[]
[0,null,133605,"13,200 lb. Pusher Axle w/Aluminum Rims and Tires  ",null,null,null,null,null,10866,11695.62,null,0]
[0,null,133606,"13,200 lb. Pusher Axle w/Steel Rims and Tires  ",null,null,null,null,null,9801,10549.31,null,0]
[0,null,133607,"13,200 lb. Pusher Axle w/o Rims and Tires  ",null,null,null,null,null,8315,8949.85,null,0]
[]
[0,null,133608,"13,200 lb. Tag Axle w/Aluminum Rims and Tires ",null,null,null,null,null,11678,12569.62,null,0]
[0,null,133609,"13,200 lb. Tag Axle w/Steel Rims and Tires ",null,null,null,null,null,10612,11422.23,null,0]
[0,null,133610,"13,200 lb. Tag Axle w/o Rims and Tires ",null,null,null,null,null,9125,9821.69,null,0]
[]
[0,null,133611,"13,200 lb. Steerable Tag w/Aluminum Rims and Tires                             ",null,null,null,null,null,12779,13754.68,null,0]
[0,null,133612,"13,200 lb. Steerable Tag w/Steel Rims and Tires                              ",null,null,null,null,null,11713,12607.29,null,0]
[0,null,133613,"13,200 lb. Steerable Tag w/o Rims and Tires                              ",null,null,null,null,null,10226,11006.76,null,0]
[{"$f":"SUM(A76:B89)","v":0},null,null,"**Consult Factory For CT/WB Requirements**",null,null,null,null,null,null,null,null,0]
["Quantity",null,null,"Lighting Options - CANBUS",null,null,null,null,null,null,"Retail Price",null,"Total Price"]
["STD",null,null,"LED Body Lights including Reverse and License Plate",null,null,null,null,null,0,{"$f":"$E$40/100*J92","v":0}]
[null,null,131109,"LED Backup Lights - mounted mid body (2 Lights)",null,null,null,null,null,354,381.03,null,{"$f":"+K93*A93","v":0}]
[null,null,129885,"LED High Intensity Backup Lights - mounted on tailgate (2 Lights)",null,null,null,null,null,409,440.23,null,{"$f":"+K94*A94","v":0}]
[null,null,131111,"LED High Intensity Work Lights (2 Lights in Hopper and 1 on Canopy)",null,null,null,null,null,354,381.03,null,{"$f":"+K95*A95","v":0}]
[null,null,133389,"LED Work Lights Mounted on Canopy Directed Toward Can (2 Lights)",null,null,null,null,null,409,440.23,null,{"$f":"+K96*A96","v":0}]
[null,null,118816,"Strobe Light Beacon (Surface Mount)",null,null,null,null,null,352,0,null,{"$f":"+K97*A97","v":0}]
[null,null,null,"Location--->",null,"Center Tailgate (standard location - edit if other location required)"]
[null,null,130554,"Strobe Light Package (Integrated Strobe System with Turn Signals - 2 round lights mounted in upper tailgate)",null,null,null,null,null,420,452.07,null,{"$f":"+K99*A99","v":0}]
[null,null,130555,"Strobe Light Package (Integrated Strobe System with Turn Signals - 2 round lights mounted in lower tailgate)",null,null,null,null,null,420,452.07,null,0]
[null,null,136785,"LED Round Strobes - 2 lights mounted in upper tailgate",null,null,null,null,null,420,452.07,null,0]
[null,null,130566,"LED Oval Strobes - 2 lights mounted in upper tailgate",null,null,null,null,null,454,488.66,null,0]
[null,null,130567,"LED Oval Strobes - 2 lights mounted in lower tailgate",null,null,null,null,null,454,488.66,null,0]
[null,null,130179,"Upper Light Bar - 2 Stop/Tail lights & 2 Turn Signal lights",null,null,null,null,null,582,463.5,null,0]
[null,null,130440,"Traffic Advisor Board (mounted mid tailgate)",null,null,null,null,null,858,923.51,null,0]
["STD",null,null,"Center Mount Brake (I.D. Cluster)",null,null,null,null,null,0,{"$f":"$E$40/100*J106","v":0}]
[null,null,130209,"Brush Guards For Upper Tailgate Light Bar (protects up to 4 lights)",null,null,null,null,null,181,194.82,null,{"$f":"+K107*A107","v":0}]
[null,null,136826,"Wiring Circuit Including switch for customer installed lights (includes switch in cab and 16 ga. wire to designated location)",null,null,null,null,null,170,182.98,null,{"$f":"+K108*A108","v":0}]
[null,null,null,"Light Location--->"]
[null,null,null,"Custom Lighting Packages: Consult your RSM for pricing and note in \"Special Instructions\" at bottom",null,null,null,null,null,null,"Consult Factory"]
["Quantity",null,null,"Safety Device Options - CANBUS",null,null,null,null,null,null,"Retail Price",null,"Total Price"]
[null,null,115670,"Back-up Alarm Upgrade (102 db)",null,null,null,null,null,80,86.11,null,{"$f":"+K112*A112","v":0}]
[null,null,135197,"Back-up Alarm Auto Volume Adjustable (87 - 112 db)",null,null,null,null,null,157,168.99,null,{"$f":"+K113*A113","v":0}]
["STD",null,null,"Over Height Warning Light - Provides visual alert when arms/forks are above cab",null,null,null,null,null,0,174.06]
[null,null,129879,"Over Height Warning Buzzer - Provides audible alert when arms/forks are above cab",null,null,null,null,null,189,203.43,null,{"$f":"+K115*A115","v":0}]
[null,null,null,"Back Up Collision Avoidance Sensor - Safety Vision camera system",null,null,null,null,null,743,799.73,null,{"$f":"+K116*A116","v":0}]
[null,null,null,"Back Up Collision Avoidance Sensor - 3rd Eye camera system",null,null,null,null,null,1221,1314.22,null,{"$f":"+K117*A117","v":0}]
[null,null,133508,"Body Hold-down Lock",null,null,null,null,null,250,269.08999999999997,null,{"$f":"+K118*A118","v":0}]
[{"$f":"IF(A120>0.5,0,IF(A58>0.5,0,\"STD\"))","v":"STD"},null,113305,"Fire Extinguisher--10lb. (standard equipment on mounted units only)",null,null,null,null,null,0,{"$f":"$E$40/100*J119","v":0}]
[null,null,113724,"Fire Extinguisher--20lb. (upgrade from 10 lb. - available on mounted units only)",null,null,null,null,null,99,109.92,null,{"$f":"+K120*A120","v":0}]
[null,null,116227,"Triangle Kit (standard equipment and only available on mounted units)",null,null,null,null,null,0,0]
[null,null,113426,"Caution Decal for Tailgate (Large)",null,null,null,null,null,270,290.61,null,{"$f":"+K122*A122","v":0}]
[null,null,128553,"Transition at top of roof from ladder",null,null,null,null,null,864,929.97,null,{"$f":"+K123*A123","v":0}]
[null,null,130550,"Fall Restraint System for Roof",null,null,null,null,null,2916,3138.64,null,{"$f":"+K124*A124","v":0}]
[null,null,126237,"Ladder Down Interlock to Shut Down Hydraulic System",null,null,null,null,null,325,349.81,null,{"$f":"+K125*A125","v":0}]
["Quantity",null,null,"Camera Options - CANBUS",null,null,null,null,null,null,"Retail Price",null,"Total Price"]
[null,null,null,"Pricing reflects our standard systems with a camera mouted on the center of the tailgate as the first location. Consult your RSM for pricing on specific brands or models and note in Special Instructions section."]
["STD",null,134376,"Dual Camera system with 7\" Color Flat Screen Monitor                                                 Center Tailgate location standard - Choose 1 additional location from list below:",null,null,null,null,null,0,{"$f":"$E$40/100*J128","v":0}]
[null,null,null,null,"1st","2nd"]
[null,null,null,null,1]
[null,null,134377,"Triple Camera system with 7\" Color Flat Screen Monitor                                                  Center Tailgate location standard - Choose 2 additional locations from list below:",null,null,null,null,null,658,708.24,null,{"$f":"K131*A131","v":0}]
[null,null,null,null,"1st","2nd","3rd"]
[null,null,null,null,1]
[null,null,134378,"Quad Camera system with 7\" Color Flat Screen Monitor                                                 Center Tailgate location standard - Choose 3 additional locations from list below:",null,null,null,null,null,1151,1238.8800000000001,null,{"$f":"+K134*A134","v":0}]
[null,null,null,null,"1st","2nd","3rd","4th"]
[null,null,null,null,1]
[null,null,136777,"Triple Camera system with 7\" Color Flat Screen Monitor & DVR                                                 Center Tailgate location standard - Choose 2 additional locations from list below:",null,null,null,null,null,2180,2346.44,null,{"$f":"K137*A137","v":0}]
[null,null,null,null,"1st","2nd","3rd"]
[null,null,null,null,1]
[null,null,136778,"Quad Camera system with 7\" Color Flat Screen Monitor & DVR                                                Center Tailgate location standard - Choose 3 additional locations from list below:",null,null,null,null,null,2673,2877.08,null,{"$f":"+K140*A140","v":0}]
[null,null,null,null,"1st","2nd","3rd","4th"]
[null,null,null,null,1]
[null,null,136675,"3rd Eye Dual Camera system with 7\" Color Flat Screen Monitor                                                 Center Tailgate location standard - Choose 1 additional location from list below:",null,null,null,null,null,675,726.54,null,{"$f":"+K143*A143","v":0}]
[null,null,null,null,"1st","2nd"]
[null,null,null,null,1]
[null,null,134010,"3rd Eye Triple Camera system with 7\" Color Flat Screen Monitor                                                  Center Tailgate location standard - Choose 2 additional locations from list below:",null,null,null,null,null,1333,1434.77,null,{"$f":"+K146*A146","v":0}]
[null,null,null,null,"1st","2nd","3rd"]
[null,null,null,null,1]
[null,null,136709,"3rd Eye Quad Camera system with 7\" Color Flat Screen Monitor                                                Center Tailgate location standard - Choose 3 additional locations from list below:",null,null,null,null,null,1991,2143.0100000000002,null,{"$f":"+K149*A149","v":0}]
[null,null,null,null,"1st","2nd","3rd","4th"]
[null,null,null,null,1]
[null,null,null,"Additional Camera Locations"]
[null,null,null,null,null,null,null,1,"Center Tailgate - facing rearward"]
[null,null,null,null,null,null,null,2,"Bulkhead"]
[null,null,null,null,null,null,null,3,"Body - Streetside, facing rearward"]
[null,null,null,null,null,null,null,4,"Midbody - facing into hopper"]
[null,null,null,null,null,null,null,5,"Tailgate - curbside to view alley"]
[null,null,null,null,null,null,null,6,"Dash - facing forward"]
[null,null,null,null,null,null,null,7,"Dash - facing driver"]
[null,null,null,null,null,null,null,99,"Other - describe in Special Instructions section"]
["Quantity",null,null,"Paint Options - CANBUS",null,null,null,null,null,null,"Retail Price",null,"Total Price"]
[null,null,null,"Two Tone, Custom Paint or Special Designs (Mounted Units Only - Must submit design drawing with this form including detailed dimensions, design specifics, logos and paint codes)  Contact your RSM for pricing and note in \"Special Instructions\""]
[null,null,null,"(We Use Axalta Imron Elite)"]
[{"$f":"1-A169","v":1},null,null,"Code:"]
[{"$f":"IF(A166+A167>0.5,0,\"STD\")","v":"STD"},null,133588,"Acrylic Urethane Enamel (White) - MUST ENTER PAINT CODE ABOVE",null,null,null,null,null,0,{"$f":"$E$40/100*J165","v":0}]
[null,null,136964,"Acrylic Urethane Enamel Color Coat - MUST ENTER COLOR & CODE ABOVE",null,null,null,null,null,1609,1731.85,null,{"$f":"+K166*A166","v":0}]
[null,null,110157,"Two Tone Or Special Design (Mounted Units Only)",null,null,null,null,null,null,"Consult Factory"]
[0,null,133568,"Clear Coat",null,null,null,null,null,2231,2401.34,null,0]
[0,null,133600,"Prime Inside Body (Recommended for Stock Units)",null,null,null,null,null,567,610.29,null,0]
[0,null,119124,"Body Undercoating/Bedliner (Mounted Units only - applied from frame rails to edge of hopper and body)",null,null,null,null,null,3270,3519.66,null,0]
[0,null,136776,"Body Undercoating/Bedliner (Mounted Units only - applied from frame rails to edge of body.  Does not include bottom of hopper)",null,null,null,null,null,2180,2346.44,null,0]
[0,null,136186,"Body Undercoating/Bedliner Applied to Canopy/Cab Cover",null,null,null,null,null,530,570.47,null,0]
["Quantity",null,null,"Steel Options - CANBUS",null,null,null,null,null,null,"Retail Price",null,"Total Price"]
[{"$f":"IF(A175+A176>0.5,0,\"STD\")","v":"STD"},null,null,"Body Roof 10GA 80K",null,null,null,null,null,0,{"$f":"$E$40/100*J174","v":0}]
[0,null,{"$f":"IF(A$51>0.5,123121,124905)","v":124905},"Body Roof 1/8\" AR450-40YD (123121-34YD)",null,null,null,null,null,645,694.25,null,{"$f":"+K175*A175","v":0}]
[0,null,{"$f":"IF(A$51>0.5,124940,123734)","v":123734},"Body Roof 3/16\" AR450-40YD (124940-34YD)",null,null,null,null,null,1255,1350.82,null,{"$f":"+K176*A176","v":0}]
[]
[{"$f":"IF(A181>0.5,0,\"STD\")","v":"STD"},null,130545,"Roof Door Solid Metal 14GA",null,null,null,null,null,0,0]
[]
[{"$f":"IF(A181>0.5,0,\"STD\")","v":"STD"},null,null,"Body Sides 1/8\" AR450",null,null,null,null,null,0,0]
[0,null,{"$f":"IF(A$51>0.5,132413,130528)","v":130528},"Body Sides 3/16\" AR450-40YD (132413-34YD)",null,null,null,null,null,1289,1387.42,null,{"$f":"+K181*A181","v":0}]
[]
[{"$f":"IF(A184+A185>0.5,0,\"STD\")","v":"STD"},null,null,"Body Floor 3/16\" AR235",null,null,null,null,null,0,0]
[0,null,{"$f":"IF(A$51>0.5,124907,131221)","v":131221},"Body Floor 3/16\" AR450-40YD (124907-34YD)",null,null,null,null,null,876,942.88,null,{"$f":"+K184*A184","v":0}]
[0,null,{"$f":"IF(A$51>0.5,131714,129928)","v":129928},"Body Floor to 1/4\" 100K-40YD (131714-34YD)",null,null,null,null,null,936,1007.46,null,{"$f":"+K185*A185","v":0}]
[0,null,131448,"Body Floor Liner 36\" Into Body 3/16\" AR450",null,null,null,null,null,645,694.25,null,{"$f":"+K186*A186","v":0}]
[0,null,{"$f":"IF(A$51>0.5,132995,130017)","v":130017},"Body Floor Liner Full Length 3/16\" AR450-40YD (132995-34YD)",null,null,null,null,null,1934,2081.66,null,{"$f":"+K187*A187","v":0}]
[]
[{"$f":"IF(A190>0.5,0,\"STD\")","v":"STD"},null,null,"Hopper Sides 3/16\" AR450",null,null,null,null,null,0,0]
[0,null,130203,"Hopper Sides 1/4\" AR450",null,null,null,null,null,1044,1123.71,null,{"$f":"+K190*A190","v":0}]
[]
[{"$f":"IF(A193>0.5,0,\"STD\")","v":"STD"},null,null,"Hopper Floor 1/4\" AR450",null,null,null,null,null,0,0]
[0,null,130015,"Hopper Floor Liner 3/16\" AR450",null,null,null,null,null,1934,2081.66,null,{"$f":"+K193*A193","v":0}]
[]
[{"$f":"IF(A196>0.5,0,\"STD\")","v":"STD"},null,127965,"Front Sump w/ Dual Clean Out Doors",null,null,null,null,null,0,0]
[0,null,132680,"No Hopper Cleanouts (Deduct)",null,null,null,null,null,-584,-628.59,null,{"$f":"+K196*A196","v":0}]
[]
[{"$f":"IF(A199>0.5,0,\"STD\")","v":"STD"},null,null,"Tailgate Bubble 1/8\" AR450",null,null,null,null,null,0,0]
[0,null,130974,"Tailgate Bubble 3/16\" AR450",null,null,null,null,null,644,693.17,null,{"$f":"+K199*A199","v":0}]
[]
[{"$f":"IF(A202>0.5,0,\"STD\")","v":"STD"},null,null,"Packer Panel Lower Face 3/16\" AR450",null,null,null,null,null,0,0]
[0,null,130525,"Packer Panel Lower Face Liner 3/16\" AR450",null,null,null,null,null,644,693.17,null,{"$f":"+K202*A202","v":0}]
[{"$f":"IF(A204>0.5,0,\"STD\")","v":"STD"},null,null,"Packer Panel Sloped Face 3/16\" AR450",null,null,null,null,null,0,0]
[0,null,130526,"Packer Panel Sloped Face & Lower Liners 3/16\" AR450",null,null,null,null,null,1095,1178.5999999999999,null,{"$f":"+K204*A204","v":0}]
[0,null,130212,"Packer Panel Construction Grade (3/16\" AR450 lower liner, \n(3) 3x3 horizontal cross braces)",null,null,null,null,null,1032,1110.79,null,{"$f":"+K205*A205","v":0}]
[0,null,128961,"Super Track Bottom Wear Strip (Hopper Only)-40YD",null,null,null,null,null,2271,2444.39,null,{"$f":"+K206*A206","v":0}]
[0,null," "," ",null,null,null,null,null,0,{"$f":"$E$40/100*J207","v":0},null,{"$f":"+K207*A207","v":0}]
[null,null,127683,"Steel Canopy (short extension)",null,null,null,null,null,0,0]
[{"$f":"IF(A210+A211+A212+A213>0.5,0,\"STD\")","v":"STD"},null,127684,"Steel Canopy (long extension)",null,null,null,null,null,0,0]
[0,null,127681,"Aluminum Canopy (short extension)",null,null,null,null,null,923,993.47,null,{"$f":"+K210*A210","v":0}]
[0,null,127682,"Aluminum Canopy (long extension)",null,null,null,null,null,923,993.47,null,{"$f":"+K211*A211","v":0}]
[0,null,132153,"Aluminum Canopy With Air Cylinder Extension",null,null,null,null,null,1296,1394.95,null,{"$f":"+K212*A212","v":0}]
[0,null,133999,"Steel Canopy With Steel Extension that is Air Raised",null,null,null,null,null,774,833.09,null,{"$f":"+K213*A213","v":0}]
[0,null,136780,"Torque Tube Reinforcement Inserts",null,null,null,null,null,181,194.82,null,{"$f":"+K214*A214","v":0}]
[null,null,null,"Custom Steel Packages: Consult your RSM for pricing and note in \"Special Instructions\" at bottom",null,null,null,null,null,null,"Consult Factory"]
["Quantity",null,null,"Hydraulics - CANBUS",null,null,null,null,null,null,"Retail Price",null,"Total Price"]
["STD",null,null,"Filter By-Pass Visual Indicator on Filter Housing",null,null,null,null,null,0,{"$f":"$E$40/100*J217","v":0},null,0]
[0,null,129868,"Filter By-Pass Visual Indicator In Cab",null,null,null,null,null,252,271.24,null,{"$f":"+K218*A218","v":0}]
[0,null,131014,"High Temperature Fluid Switch Visual Indicator in Cab",null,null,null,null,null,495,532.79,null,0]
[0,null,129871,"Low Fluid Level Switch Visual Indicator in Cab",null,null,null,null,null,495,532.79,null,0]
[0,null,129869,"Hydraulic Shut Down When One or More of the Following Condtitions Exist:  Filter By-Pass, High Temperature Fluid and/or Low Fluid Level (NOTE: REQUIRES VISUAL INDICATOR IN CAB FOR EACH INPUT) ",null,null,null,null,null,528,568.30999999999995,null,0]
[0,null,104217,"Hour Meter on PTO",null,null,null,null,null,268,288.45999999999998,null,0]
[0,null,115506,"In Tank Oil Heater (120 Volt w/plug in)",null,null,null,null,null,1408,1515.5,null,0]
["STD",null,null,"Aluminum Oil Tank With In Tank Filtration",null,null,null,null,null,0,0]
[0,null,127714,"High Pressure Schroeder Filter",null,null,null,null,null,1451,1561.78,null,{"$f":"+K225*A225","v":0}]
["STD",null,null,"Quick Disconnect Port for Pressure Gage",null,null,null,null,null,0,0,null,0]
[0,null,124738,"Quick Disconnect Pressure Gage",null,null,null,null,null,96,106.34,null,{"$f":"+K227*A227","v":0}]
[null,null,null,"Custom Hydraulic Packages:  Consult your RSM for pricing and note in \"Special Instructions\" at bottom",null,null,null,null,null,null,"Consult Factory"]
["Quantity",null,null,"Fork and Arm Options - CANBUS",null,null,null,null,null,null,"Retail Price",null,"Total Price"]
[{"$f":"IF(A231>0.5,0,\"STD\")","v":"STD"},null,128363,"Single Handle Quad Control Joystick",null,null,null,null,null,0,{"$f":"$E$40/100*J230","v":0}]
[0,null,128368,"Dual Lever Controls",null,null,null,null,null,468,503.73,null,{"$f":"+K231*A231","v":0}]
[]
[{"$f":"IF(A234>0.5,0,\"STD\")","v":"STD"},null,null,"8,000 lb. Lift Rating Arms including 4.5\" Arm Cylinder and 3.5\" Fork Cylinder",null,null,null,null,null,0,{"$f":"$E$40/100*J233","v":0}]
[0,null,132955,"10,000 lb. Lift Rating Arms including 5\" Arm Cylinder and 4\" Fork Cylinder",null,null,null,null,null,2173,2338.91,null,{"$f":"+K234*A234","v":0}]
[null,null,null,null,null,null,null,null,null,null,null,null,null,null,null,null,null," "]
[{"$f":"IF(A237+A239+A240+A241+A242+A244+A245+A246+A247+A248+A250+A251+A252+A254+A255>0.5,0,\"STD\")","v":"STD"},null,110122,"Fork Thickness 1 1/4\" 100K with hook (44\" usable bumper to hook)",null,null,null,null,null,0,{"$f":"$E$40/100*J236","v":0}]
[0,null,129844,"Fork Thickness 1\" 100K smooth no hook (48\" usable bumper to tip)",null,null,null,null,null,null,0]
[]
[0,null,112140,"Fork Thickness 1 1/4\" 100K smooth no hook (48\" usable bumper to tip)",null,null,null,null,null,138,148.54,null,{"$f":"+K239*A239","v":0}]
[0,null,121901,"Fork Thickness 1 1/4\" 100K with hook (48\" usable bumper to hook)",null,null,null,null,null,184,153,null,0]
[0,null,125087,"Fork Thickness 1 1/4\" 100K with hook (58-1/2\" usable bumper to hook)",null,null,null,null,null,386,415.47,null,0]
[0,null,125085,"Fork Thickness 1 1/4\" 100K with hook (66\" usable bumper to hook)",null,null,null,null,null,678,729.77,null,0]
[]
[0,null,108746,"Fork Thickness 1 1/2\" 100K with hook (44\" usable bumper to hook)",null,null,null,null,null,392,421.93,null,0]
[0,null,121843,"Fork Thickness 1 1/2\" 100K with hook (48\" usable bumper to hook)",null,null,null,null,null,486,523.11,null,0]
[0,null,125084,"Fork Thickness 1 1/2\" 100K with hook (58\" usable bumper to hook)",null,null,null,null,null,721,776.05,null,0]
[0,null,120162,"Fork Thickness 1 1/2\" 100K with hook (61\" usable bumper to hook)",null,null,null,null,null,791,851.39,null,0]
[0,null,124649,"Fork Thickness 1 1/2\" 100K with hook (66\" usable bumper to hook)",null,null,null,null,null,909,978.4,null,0]
[]
[0,null,125082,"Fork Thickness 1 1/2\" 100K smooth no hook (48\" usable bumper to tip)",null,null,null,null,null,486,523.11,null,0]
[0,null,130055,"Fork Thickness 1 1/2\" 100K smooth no hook (58-1/2\" usable bumper to tip)",null,null,null,null,null,721,776.05,null,0]
[0,null,109306,"Fork Thickness 1 1/2\" 100K smooth no hook (65\" usable bumper to tip)",null,null,null,null,null,909,978.4,null,0]
[]
[0,null,130564,"Fork Width Adjustment Hydraulic (both sides  22\" ea) 50.75\" Usable Smooth 1 1/2\"",null,null,null,null,null,3028,3259.19,null,{"$f":"+K254*A254","v":0}]
[0,null,130565,"Fork Width Adjustment Hydraulic (both sides  22\" ea) 46.5\" Usable Hook",null,null,null,null,null,2934,3158.01,null,0]
[]
[0,null,118855,"Fork Limiter to retain can on forks during dumping",null,null,null,null,null,189,203.43,null,0]
[0,null,130177,"Fork Cylinders Upgrade - Increase from 3.5\" to 4\" Diameter",null,null,null,null,null,345,371.34,null,0]
[null,null,null,null,null,null,null,null,null,null,null,null,0]
[null,null,null,"Residential Package Options - CANBUS"]
[0,null,129884,"Outside Controls For Arms, Forks, Packing w/ E- Stop",null,null,null,null,null,1335,1436.93,null,0]
[0,null,129881,"Curbside In Cab Arm/Fork Controls",null,null,null,null,null,1129,1215.2,null,0]
[0,null,131628,"Deceleration On Arms Down Function",null,null,null,null,null,1031,1109.72,null,0]
[0,null,130546,"Cradle Support for Arms Down",null,null,null,null,null,482,518.79999999999995,null,0]
[0,null,130551,"Curotto Can Ready with Controls, Plumbing to Quick Disconnects at Fork Pivot, Harnesses, Cradle to Support Arms Down and Deceleration Arms Down\n(With Out Automated Arm and Can)",null,null,null,null,null,13855,14912.83,null,0]
[0,null,132218,"Complete Residential Package Including: Residential Carry Can w/tipper fork cradle\n(includes curbside in cab arm/fork controls)",null,null,null,null,null,10935,11769.89,null,0]
[0,null,129880,"Auto Dump ",null,null,null,null,null,3768,4055.69,null,0]
[0,null,131467,"Plumb Only For Residential Container (Includes Tap-In and Plumbing to front forks)",null,null,null,null,null,1809,1947.12,null,0]
[null,null,null,"Custom Arm/Fork Options:  Consult your RSM for pricing and note in \"Special Instructions\" at bottom",null,null,null,null,null,null,"Consult Factory"]
["Quantity",null,null,"Accessories - CANBUS",null,null,null,null,null,null,"Retail Price",null,"Total Price"]
[0,null,130571,"Shovel/Broom Rack",null,null,null,null,null,197,212.04,null,{"$f":"+K271*A271","v":0}]
[null,null,null,"Location:","Back side of front bulkhead screen"]
[0,null,130175,"Extending cleaning tool with broom attachment and holder",null,null,null,null,null,285,306.76,null,{"$f":"+K273*A273","v":0}]
[0,null,104252,"Steel Tool Box 18x18x24 (must confirm space available to mount)",null,null,null,null,null,526,566.16,null,0]
[0,null,104253,"Steel Tool Box 18x18x36 (must confirm space available to mount)",null,null,null,null,null,615,661.96,null,0]
[0,null,104254,"Steel Tool Box 18x18x48 (must confirm space available to mount)",null,null,null,null,null,674,725.46,null,0]
[0,null,115378,"Container Washout Tank Air 35 Gallon (must confirm space available to mount)",null,null,null,null,null,1566,1685.56,null,0]
[0,null,113771,"Container Washout Tank Air 50Gallon (must confirm space available to mount)",null,null,null,null,null,1691,1820.11,null,0]
[0,null,129862,"Container Disinfectant Tank Elec. 50 Gallon (must confirm space available to mount)",null,null,null,null,null,2394,2576.7800000000002,null,0]
[0,null,114463,"Auto Lube (Up to 20 Points)",null,null,null,null,null,6038,6499,null,0]
[0,null,131218,"Remote Grease tailgate hinge & cylinders",null,null,null,null,null,378,406.86,null,0]
[{"$f":"IF(A283+A284>0.5,0,\"STD\")","v":"STD"},null,120908,"Sliding Access Door (Fiber Glass)",null,null,null,null,null,0,{"$f":"$E$40/100*J282","v":0}]
[0,null,123701,"Sliding Access Door (Steel)",null,null,null,null,null,414,445.61,null,{"$f":"+K283*A283","v":0}]
[0,null,130487,"Dual Access Door",null,null,null,null,null,526,566.16,null,0]
[0,null,130304,"Rubber Fender Skirt Extension (Required for rear tires wider than 98.5\")-40YD\n(130734-34YD)",null,null,null,null,null,270,290.61,null,0]
[0,null,129845,"National Standard Fire Hose Port",null,null,null,null,null,1296,1394.95,null,0]
[0,null,130176,"Aluminum Drip Pan Below Tailgate Seal (135871-Autocar 4-axle)",null,null,null,null,null,729,784.66,null,0]
[0,null,128856,"Upper Tailgate Seal Extension Rubber (Std. 36\" + Additional 36\" Drip Guard)",null,null,null,null,null,596,641.5,null,0]
["Quantity",null,null,"Warranty Options - CANBUS",null,null,null,null,null,null,"Retail Price",null,"Total Price"]
["stay",null,null,"All Warranties Are Conditional--Refer To Warranty Statement"]
[]
[{"$f":"IF(A293+A294+A295>0.5,0,\"STD\")","v":"STD"},null,null,"2-Year Cylinder Warranty",null,null,null,null,null,0,{"$f":"$E$40/100*J292","v":0}]
[null,null,119324,"3-Year Cylinder Warranty",null,null,null,null,null,1835,1975.1,null,{"$f":"+K293*A293","v":0}]
[null,null,119325,"4-Year Cylinder Warranty",null,null,null,null,null,4171,4489.46,null,{"$f":"+K294*A294","v":0}]
[null,null,119326,"5-Year Cylinder Warranty",null,null,null,null,null,5283,5686.36,null,{"$f":"+K295*A295","v":0}]
[]
[{"$f":"IF(A298+A299+A300+A301>0.5,0,\"STD\")","v":"STD"},null,119327,"1-Year Body Warranty",null,null,null,null,null,0,{"$f":"$E$40/100*J297","v":0}]
[0,null,119328,"2-Year Body Warranty",null,null,null,null,null,1285,1383.11,null,{"$f":"+K298*A298","v":0}]
[0,null,121178,"3-Year Body Warranty",null,null,null,null,null,2570,2766.22,null,{"$f":"+K299*A299","v":0}]
[0,null,130547,"4-Year Body Warranty",null,null,null,null,null,3856,4150.41,null,{"$f":"+K300*A300","v":0}]
[0,null,124531,"5-Year Body Warranty",null,null,null,null,null,5044,5429.11,null,{"$f":"+K301*A301","v":0}]
[null,null,null,null,null,null,null,null,null,null,null,null,{"$f":"+K302*A302","v":0}]
[{"$f":"IF(A304+A305+A306+A307>0.5,0,\"STD\")","v":"STD"},null,116572,"1-Year Hydraulic Warranty",null,null,null,null,null,0,{"$f":"$E$40/100*J303","v":0}]
[0,null,119329,"2-Year Hydraulic Warranty",null,null,null,null,null,1604,1726.47,null,{"$f":"+K304*A304","v":0}]
[0,null,119330,"3-Year Hydraulic Warranty",null,null,null,null,null,2403,2586.4699999999998,null,{"$f":"+K305*A305","v":0}]
[0,null,119345,"4-Year Hydraulic Warranty (Excludes Cylinders)",null,null,null,null,null,3242,3489.53,null,{"$f":"+K306*A306","v":0}]
[0,null,119331,"5-Year Hydraulic Warranty (Excludes Cylinders)",null,null,null,null,null,4080,4391.51,null,{"$f":"+K307*A307","v":0}]
[0]
[0,null,null,"Note: All Extended Hydraulic/Cylinder Warranties include a spare set of \nreplacment filters and breather",null,null,null,null,null,null,null,null,{"$f":"+K309*A309","v":0}]
["Special Instructions - CANBUS (Consult Factory for Pricing)"]
["Quantity",null,"Instruction",null,null,null,null,null,null,null,"Retail Price",null,"Total Price"]
[null,null,null,null,null,null,null,null,null,null,null,null,{"$f":"+K312*A312","v":0}]
[null,null,null,null,null,null,null,null,null,null,null,null,0]
[null,null,null,null,null,null,null,null,null,null,null,null,0]
[null,null,null,null,null,null,null,null,null,null,null,null,0]
[null,null,null,null,null,null,null,null,null,null,null,null,0]
[null,null,null,null,null,null,null,null,null,null,null,null,0]
[null,null,null,null,null,null,null,null,null,null,null,null,0]
[null,null,null,null,null,null,null,null,null,null,null,null,0]
[null,null,null,null,null,null,null,null,null,null,null,null,0]
[null,null,null,null,null,null,null,null,null,null,null,null,0]
[null,null,null,null,null,null,null,null,null,null,null,null,0]
[null,null,null,null,null,null,null,null,null,null,null,null,0]
[null,null,null,null,null,null,null,null,null,null,null,null,0]
[null,null,null,"IF ANY ADDITIONAL ROWS ARE ADDED, CONFIRM $ VALUES ARE ADDED TO THE TOTAL"]
[null,null,null,"BELOW - LIST BREIF SUMMARY OF DELIVERY REQUEST"]

{"sheet":" STD Frontloader AIR","index":3,"n_rows":329,"n_cols":18,"rows_kept":329,"cut":false,"hidden":false,"merged":[[310,0,310,1],[310,3,310,8],[310,10,310,11],[310,12,310,14],[311,0,311,1],[311,3,311,8],[311,10,311,11],[311,12,311,14],[305,0,305,1],[305,3,305,8],[305,10,305,11],[305,12,305,14],[306,0,306,1],[306,3,306,8],[306,10,306,11],[306,12,306,14],[307,0,307,1],[307,3,307,8],[307,10,307,11],[307,12,307,14],[308,12,308,14],[300,0,300,1],[300,3,300,8],[300,10,300,11],[300,12,300,14],[301,0,301,1],[301,3,301,8],[301,10,301,11],[301,12,301,14],[302,0,302,1],[302,3,302,8],[302,10,302,11],[302,12,302,14],[309,12,309,14],[303,0,303,1],[303,3,303,8],[303,10,303,11],[303,12,303,14],[304,0,304,1],[304,3,304,8],[304,10,304,11],[304,12,304,14],[299,3,299,8],[299,10,299,11],[299,12,299,14],[292,0,292,1],[292,3,292,8],[292,10,292,11],[292,12,292,14],[293,0,293,1],[293,3,293,8],[293,10,293,11],[293,12,293,14],[294,0,294,1],[294,3,294,8],[294,10,294,11],[294,12,294,14],[296,0,296,1],[297,3,297,8],[297,12,297,14],[298,0,298,1],[298,3,298,8],[298,10,298,11],[298,12,298,14],[234,12,234,14],[254,12,254,14],[258,12,258,14],[258,10,258,11],[224,10,224,11],[222,10,222,11],[241,10,241,11],[251,10,251,11],[259,10,259,11],[249,12,249,14],[246,10,246,11],[243,10,243,11],[242,10,242,11],[252,12,252,14],[247,12,247,14],[230,10,230,11],[226,10,226,11],[253,10,253,11],[243,12,243,14],[223,12,223,14],[230,12,230,14],[246,12,246,14],[248,10,248,11],[232,10,232,11],[204,12,204,14],[205,0,205,1],[205,3,205,8],[205,10,205,11],[205,12,205,14],[207,0,207,1],[206,0,206,1],[206,3,206,8],[206,10,206,11],[206,12,206,14],[212,0,212,1],[212,3,212,8],[212,10,212,11],[212,12,212,14],[263,12,263,14],[217,12,217,14],[241,12,241,14],[237,10,237,11],[237,12,237,14],[235,3,235,8],[233,12,233,14],[224,12,224,14],[225,3,225,8],[221,3,221,8],[221,12,221,14],[218,12,218,14],[233,10,233,11],[216,10,216,11],[228,10,228,11],[225,10,225,11],[226,12,226,14],[259,12,259,14],[122,10,122,11],[136,10,138,11],[139,12,141,14],[123,10,123,11],[123,12,123,14],[197,0,197,1],[197,3,197,8],[197,10,197,11],[197,12,197,14],[210,12,210,14],[211,0,211,1],[211,3,211,8],[211,10,211,11],[211,12,211,14],[213,0,213,1],[213,3,213,8],[213,10,213,11],[213,12,213,14],[161,3,161,8],[148,9,150,9],[148,10,150,11],[148,12,150,14],[174,10,174,11],[174,12,174,14],[188,12,188,14],[195,12,195,14],[189,3,189,8],[145,12,147,14],[160,10,160,11],[151,3,152,6],[152,8,152,11],[153,8,153,11],[111,0,111,1],[96,3,96,8],[113,0,113,1],[113,3,113,8],[125,3,125,8],[111,3,111,8],[119,3,119,8],[105,0,105,1],[105,3,105,8],[127,3,127,8],[148,0,150,1],[148,3,148,8],[109,3,109,8],[120,3,120,8],[119,0,119,1],[116,0,116,1],[116,3,116,8],[139,3,139,8],[145,3,145,8],[110,3,110,8],[123,3,123,8],[125,0,125,1],[118,0,118,1],[112,0,112,1],[121,0,121,1],[121,3,121,8],[145,0,147,1],[106,0,106,1],[106,3,106,8],[107,0,108,1],[102,3,102,8],[121,10,121,11],[121,12,121,14],[142,10,144,11],[127,9,129,9],[130,10,132,11],[130,9,132,9],[120,0,120,1],[118,3,118,8],[112,3,112,8],[114,3,114,8],[117,3,117,8],[115,3,115,8],[123,0,123,1],[136,3,136,8],[142,0,144,1],[142,9,144,9],[142,3,142,8],[119,12,119,14],[120,10,120,11],[120,12,120,14],[117,12,117,14],[126,3,126,8],[126,0,126,1],[126,10,126,11],[126,12,126,14],[130,12,132,14],[133,12,135,14],[133,10,135,11],[122,0,122,1],[127,12,129,14],[124,3,124,8],[125,12,125,14],[322,12,322,14],[315,0,315,1],[323,0,323,1],[133,9,135,9],[136,9,138,9],[182,0,182,1],[182,3,182,8],[177,3,177,8],[177,10,177,11],[177,12,177,14],[179,0,179,1],[179,3,179,8],[179,10,179,11],[179,12,179,14],[180,0,180,1],[180,3,180,8],[180,10,180,11],[180,12,180,14],[175,0,175,1],[175,3,175,8],[175,10,175,11],[175,12,175,14],[186,12,186,14],[139,9,141,9],[139,10,141,11],[162,0,162,1],[162,3,162,8],[207,3,207,8],[207,10,207,11],[207,12,207,14],[214,0,214,1],[214,3,214,8],[81,12,81,14],[85,12,85,14],[78,3,78,8],[78,10,78,11],[78,12,78,14],[325,12,325,14],[188,0,188,1],[318,0,318,1],[318,10,318,11],[318,12,318,14],[319,0,319,1],[319,10,319,11],[319,12,319,14],[320,0,320,1],[320,10,320,11],[320,12,320,14],[315,10,315,11],[315,12,315,14],[316,0,316,1],[316,10,316,11],[316,12,316,14],[317,0,317,1],[317,10,317,11],[317,12,317,14],[255,12,255,14],[251,12,251,14],[235,12,235,14],[321,0,321,1],[321,10,321,11],[321,12,321,14],[322,0,322,1],[322,10,322,11],[227,12,227,14],[65,3,65,8],[65,10,65,11],[65,12,65,14],[165,3,165,8],[163,0,163,1],[167,3,167,8],[163,5,163,8],[164,3,164,8],[160,0,160,1],[127,0,129,1],[109,0,109,1],[124,0,124,1],[117,0,117,1],[115,0,115,1],[114,0,114,1],[74,0,74,1],[74,3,74,8],[74,10,74,11],[165,12,165,14],[167,12,167,14],[165,0,165,1],[164,0,164,1],[139,0,141,1],[79,0,79,1],[79,3,79,8],[79,10,79,11],[79,12,79,14],[92,0,92,1],[93,0,93,1],[94,0,94,1],[92,10,92,11],[160,3,160,8],[163,12,163,14],[164,12,164,14],[230,0,230,1],[176,0,176,1],[178,0,178,1],[181,0,181,1],[187,0,187,1],[199,0,199,1],[196,0,196,1],[193,0,193,1],[190,0,190,1],[161,0,161,1],[163,3,163,4],[172,3,172,8],[168,3,168,8],[172,0,172,1],[168,0,168,1],[189,12,189,14],[191,0,191,1],[191,3,191,8],[191,10,191,11],[162,12,162,14],[214,12,214,14],[186,0,186,1],[186,3,186,8],[194,0,194,1],[194,3,194,8],[183,0,183,1],[183,3,183,8],[229,10,229,11],[168,12,168,14],[161,12,161,14],[191,12,191,14],[192,10,192,11],[192,12,192,14],[194,10,194,11],[194,12,194,14],[209,10,209,11],[209,12,209,14],[198,10,198,11],[198,12,198,14],[200,10,200,11],[200,12,200,14],[201,10,201,11],[201,12,201,14],[208,12,208,14],[189,10,189,11],[172,10,172,11],[173,10,173,11],[173,12,173,14],[168,10,168,11],[188,10,188,11],[182,10,182,11],[182,12,182,14],[183,10,183,11],[183,12,183,14],[184,12,184,14],[185,10,185,11],[185,12,185,14],[202,12,202,14],[203,10,203,11],[203,12,203,14],[204,10,204,11],[107,9,108,9],[51,0,51,1],[218,3,218,8],[224,0,224,1],[219,3,219,8],[188,3,188,8],[208,0,208,1],[208,3,208,8],[217,10,217,11],[195,3,195,8],[195,10,195,11],[210,0,210,1],[210,3,210,8],[210,10,210,11],[216,0,216,1],[173,0,173,1],[174,0,174,1],[202,10,202,11],[208,10,208,11],[220,10,220,11],[223,10,223,11],[177,0,177,1],[186,10,186,11],[195,0,195,1],[192,0,192,1],[209,0,209,1],[209,3,209,8],[198,0,198,1],[198,3,198,8],[200,0,200,1],[200,3,200,8],[201,0,201,1],[145,9,147,9],[189,0,189,1],[234,10,234,11],[47,0,47,1],[51,10,51,11],[47,12,47,14],[58,10,58,11],[56,10,56,11],[57,10,57,11],[260,12,260,14],[136,0,138,1],[130,0,132,1],[130,3,130,8],[133,0,135,1],[133,3,133,8],[327,12,327,14],[313,12,313,14],[285,12,285,14],[291,10,291,11],[291,12,291,14],[276,10,276,11],[220,3,220,8],[220,0,220,1],[219,10,219,11],[261,12,261,14],[254,0,254,1],[237,3,237,8],[253,3,253,8],[261,0,261,1],[261,3,261,8],[261,10,261,11],[142,12,144,14],[124,10,124,11],[218,10,218,11],[43,10,43,11],[43,12,43,14],[44,12,44,14],[68,10,68,11],[66,10,66,11],[55,12,55,14],[50,12,50,14],[283,10,283,11],[281,10,281,11],[283,12,283,14],[69,10,69,11],[220,12,220,14],[228,12,228,14],[90,12,90,14],[90,10,90,11],[145,10,147,11],[164,10,164,11],[172,12,172,14],[264,10,264,11],[227,10,227,11],[252,10,252,11],[235,10,235,11],[247,10,247,11],[215,12,215,14],[199,12,199,14],[196,12,196,14],[193,12,193,14],[190,12,190,14],[187,12,187,14],[181,12,181,14],[0,0,0,14],[55,0,55,1],[49,3,49,8],[51,3,51,8],[49,0,49,1],[58,0,58,1],[57,0,57,1],[66,3,66,8],[63,0,63,1],[60,0,60,1],[61,3,61,8],[61,0,61,1],[63,3,63,8],[62,3,62,8],[64,0,64,1],[64,3,64,8],[59,0,59,1],[59,3,59,8],[58,12,58,14],[53,3,53,8],[53,12,53,14],[56,0,56,1],[54,0,54,1],[50,0,50,1],[55,3,55,8],[52,0,52,1],[53,0,53,1],[50,3,50,8],[65,0,65,1],[86,12,86,14],[89,12,89,14],[56,12,56,14],[72,12,72,14],[61,10,61,11],[57,12,57,14],[64,10,64,11],[64,12,64,14],[59,10,59,11],[59,12,59,14],[80,12,80,14],[82,10,82,11],[82,12,82,14],[83,10,83,11],[63,12,63,14],[58,3,58,8],[57,3,57,8],[62,12,62,14],[60,10,60,11],[74,12,74,14],[75,3,75,8],[75,10,75,11],[75,12,75,14],[84,12,84,14],[89,3,89,8],[83,12,83,14],[76,12,76,14],[60,12,60,14],[87,12,87,14],[88,3,88,8],[88,10,88,11],[88,12,88,14],[125,10,125,11],[127,10,129,11],[39,7,39,11],[40,13,40,14],[124,12,124,14],[48,12,48,14],[82,0,82,1],[82,3,82,8],[83,0,83,1],[83,3,83,8],[84,0,84,1],[84,3,84,8],[104,10,104,11],[103,10,103,11],[103,12,103,14],[101,10,101,11],[101,12,101,14],[104,12,104,14],[86,10,86,11],[39,0,39,2],[40,8,40,12],[49,12,49,14],[51,12,51,14],[52,12,52,14],[40,3,40,4],[40,6,40,7],[54,10,54,11],[41,12,41,14],[48,10,48,11],[39,12,39,14],[48,0,48,1],[52,3,52,8],[178,12,178,14],[176,12,176,14],[222,12,222,14],[50,10,50,11],[122,12,122,14],[122,3,122,8],[76,10,76,11],[62,10,62,11],[63,10,63,11],[73,10,73,11],[71,10,71,11],[68,12,68,14],[53,10,53,11],[52,10,52,11],[60,3,60,8],[62,0,62,1],[47,3,47,8],[217,0,217,1],[89,10,89,11],[72,10,72,11],[95,10,95,11],[80,10,80,11],[116,10,116,11],[48,3,48,8],[160,12,160,14],[136,12,138,14],[162,10,162,11],[165,10,165,11],[163,10,163,11],[167,10,167,11],[66,0,66,1],[68,3,68,8],[167,0,167,1],[226,0,226,1],[232,0,232,1],[221,10,221,11],[216,3,216,8],[217,3,217,8],[215,3,215,8],[223,3,223,8],[229,0,229,1],[222,3,222,8],[224,3,224,8],[228,0,228,1],[219,0,219,1],[222,0,222,1],[218,0,218,1],[201,3,201,8],[202,0,202,1],[173,3,173,8],[174,3,174,8],[226,3,226,8],[229,3,229,8],[230,3,230,8],[184,0,184,1],[185,0,185,1],[185,3,185,8],[214,10,214,11],[202,3,202,8],[203,0,203,1],[203,3,203,8],[204,0,204,1],[204,3,204,8],[248,3,248,8],[242,3,242,8],[245,3,245,8],[249,3,249,8],[267,3,267,8],[268,3,268,8],[233,0,233,1],[233,3,233,8],[216,12,216,14],[215,10,215,11],[221,0,221,1],[215,0,215,1],[223,0,223,1],[225,0,225,1],[225,12,225,14],[184,3,184,8],[184,10,184,11],[228,3,228,8],[227,0,227,1],[227,3,227,8],[219,12,219,14],[256,12,256,14],[253,12,253,14],[232,12,232,14],[239,12,239,14],[242,12,242,14],[239,10,239,11],[229,12,229,14],[247,3,247,8],[248,12,248,14],[256,10,256,11],[239,3,239,8],[328,0,329,1],[327,3,327,8],[328,3,329,8],[328,10,329,11],[328,12,329,14],[312,0,312,14],[313,10,313,11],[327,0,327,1],[327,10,327,11],[313,0,313,1],[287,12,287,14],[287,0,287,1],[291,3,291,8],[288,0,288,1],[245,12,245,14],[326,0,326,1],[326,10,326,11],[326,12,326,14],[323,10,323,11],[323,12,323,14],[324,0,324,1],[324,10,324,11],[324,12,324,14],[325,0,325,1],[325,10,325,11],[289,0,289,1],[289,3,289,8],[291,0,291,1],[287,3,287,8],[314,0,314,1],[247,0,247,1],[268,0,268,1],[314,12,314,14],[275,12,275,14],[276,0,276,1],[272,9,273,9],[289,10,289,11],[289,12,289,14],[288,10,288,11],[285,10,285,11],[288,12,288,14],[284,10,284,11],[284,12,284,14],[282,12,282,14],[278,12,278,14],[281,12,281,14],[279,10,279,11],[280,10,280,11],[286,12,286,14],[282,10,282,11],[287,10,287,11],[274,10,274,11],[279,12,279,14],[288,3,288,8],[296,3,296,8],[296,10,296,11],[296,12,296,14],[297,0,297,1],[274,3,274,8],[274,0,274,1],[275,0,275,1],[286,10,286,11],[286,0,286,1],[308,0,308,1],[284,3,284,8],[273,4,273,8],[279,3,279,8],[285,3,285,8],[285,0,285,1],[252,0,252,1],[258,0,258,1],[265,0,265,1],[264,0,264,1],[259,3,259,8],[260,3,260,8],[256,3,256,8],[258,3,258,8],[255,10,255,11],[253,0,253,1],[314,10,314,11],[308,3,308,8],[308,10,308,11],[309,0,309,1],[309,3,309,8],[309,10,309,11],[297,10,297,11],[267,0,267,1],[259,0,259,1],[263,0,263,1],[260,0,260,1],[266,0,266,1],[256,0,256,1],[255,3,255,8],[266,3,266,8],[255,0,255,1],[299,0,299,1],[98,3,98,8],[91,3,91,8],[72,0,72,1],[90,0,90,1],[94,3,94,8],[107,3,107,8],[90,3,90,8],[91,0,91,1],[101,0,101,1],[102,0,102,1],[85,0,85,1],[81,0,81,1],[77,0,77,1],[75,0,75,1],[86,0,86,1],[89,0,89,1],[78,0,78,1],[95,3,95,8],[80,3,80,8],[86,3,86,8],[87,0,87,1],[87,3,87,8],[88,0,88,1],[77,12,77,14],[98,12,98,14],[99,0,99,1],[99,3,99,8],[270,12,270,14],[280,12,280,14],[278,10,278,11],[272,3,272,8],[266,12,266,14],[269,0,269,1],[272,10,273,11],[279,0,279,1],[118,12,118,14],[98,10,98,11],[249,10,249,11],[272,2,273,2],[263,10,263,11],[264,3,264,8],[271,0,271,1],[277,0,277,1],[265,3,265,8],[263,3,263,8],[269,3,269,8],[280,3,280,8],[271,3,271,8],[277,3,277,8],[280,0,280,1],[270,0,270,1],[270,3,270,8],[105,10,105,11],[110,0,110,1],[98,0,98,1],[108,5,108,8],[96,9,97,9],[97,3,97,4],[97,5,97,8],[96,12,96,14],[70,12,70,14],[73,12,73,14],[69,12,69,14],[71,12,71,14],[70,10,70,11],[91,12,91,14],[91,10,91,11],[84,10,84,11],[67,0,67,1],[67,3,67,8],[68,0,68,1],[69,3,69,8],[70,0,70,1],[71,0,71,1],[73,0,73,1],[76,0,76,1],[76,3,76,8],[80,0,80,1],[92,3,92,8],[93,3,93,8],[95,12,95,14],[93,10,93,11],[94,10,94,11],[92,12,92,14],[93,12,93,14],[94,12,94,14],[87,10,87,11],[95,0,95,1],[111,12,111,14],[109,12,109,14],[112,12,112,14],[119,10,119,11],[112,10,112,11],[118,10,118,11],[109,10,109,11],[114,10,114,11],[117,10,117,11],[115,10,115,11],[111,10,111,11],[113,10,113,11],[113,12,113,14],[116,12,116,14],[110,10,110,11],[99,12,99,14],[96,0,97,1],[96,2,97,2],[96,10,97,11],[105,12,105,14],[106,10,106,11],[106,12,106,14],[102,10,102,11],[102,12,102,14],[115,12,115,14],[110,12,110,14],[114,12,114,14],[107,10,108,11],[99,10,99,11],[107,12,108,14],[108,3,108,4],[29,1,29,3],[29,4,29,6],[29,8,29,13],[31,1,31,3],[31,4,31,6],[25,7,25,8],[25,10,25,13],[27,7,27,13],[55,10,55,11],[66,12,66,14],[73,3,73,8],[70,3,70,8],[69,0,69,1],[71,3,71,8],[67,10,67,11],[67,12,67,14],[72,3,72,8],[54,12,54,14],[47,10,47,11],[49,10,49,11],[54,3,54,8],[56,3,56,8],[61,12,61,14],[330,0,330,1],[330,3,330,8],[330,10,330,11],[330,12,330,14],[169,0,169,1],[169,3,169,8],[169,10,169,11],[169,12,169,14],[170,0,170,1],[170,3,170,8],[170,10,170,11],[170,12,170,14],[171,0,171,1],[171,3,171,8],[171,10,171,11],[171,12,171,14],[248,0,248,1],[251,3,251,8],[246,3,246,8],[252,3,252,8],[254,3,254,8],[242,0,242,1],[245,0,245,1],[243,0,243,1],[283,0,283,1],[281,3,281,8],[283,3,283,8],[270,10,270,11],[265,10,265,11],[265,12,265,14],[266,10,266,11],[268,12,268,14],[2,0,2,1],[2,2,2,5],[2,7,2,9],[2,10,2,13],[4,0,4,1],[4,2,4,5],[4,6,4,8],[4,10,4,13],[7,0,7,2],[7,3,7,6],[7,8,7,13],[8,8,8,13],[9,8,9,11],[9,12,9,13],[10,8,10,10],[10,11,10,13],[11,1,11,6],[11,8,11,13],[281,0,281,1],[12,1,12,6],[12,8,12,13],[13,1,13,6],[31,8,31,13],[295,3,295,8],[295,10,295,11],[295,0,295,1],[295,12,295,14],[16,1,16,3],[16,4,16,6],[16,8,16,10],[16,12,16,13],[17,1,17,3],[17,5,17,6],[17,8,17,10],[17,12,17,13],[20,5,20,13],[33,1,33,3],[33,4,33,6],[33,7,33,10],[33,11,33,13],[34,1,34,3],[34,5,34,6],[36,4,36,6],[21,5,21,13],[22,5,22,8],[22,10,22,11],[23,10,23,11],[24,5,24,6],[24,7,24,8],[24,10,24,13],[278,0,278,1],[154,8,154,11],[155,8,155,11],[156,8,156,11],[157,8,157,11],[158,8,158,11],[159,8,159,11],[314,2,314,8],[315,2,315,8],[290,0,290,1],[290,3,290,8],[290,10,290,11],[262,3,262,8],[262,12,262,14],[262,0,262,1],[240,12,240,14],[244,12,244,14],[250,12,250,14],[250,0,250,1],[244,0,244,1],[240,0,240,1]],"merged_total":1075,"flags":["merged_cut"]}
["New Way Distributor Price Sheet - Mammoth Standard Front Loaders AIR"]
[null,null,null,null,null,null,"July 1st 20019 Pricing Rev 1"]
["Model:",null,null,null,null,null,null,"Requested Ship Date:"]
[null,null,null,null,null,null,null,null,null,null,null,null,null,"Note Penalties If Applicable (Must Be Preapproved)"]
["Date:",null,null,null,null,null,"Purchase Order #:"]
[]
[]
["Distributor Name:",null,null,null,null,null,null,"Contact:"]
[null,null,null,null,null,null,null,null,"Name"]
[]
[null,null,null,null,null,null,null,null,"Email",null,null,"Phone"]
[null,"Bill To:",null,null,null,null,null,null,"Ship To:"]
[]
[null,"Address",null,null,null,null,null,null,"Address"]
[]
[null,"City",null,null,null,"State","Zip",null,"City",null,null,null,"State","Zip"]
[]
[null,"Phone #",null,null,null,"Fax #",null,null,"Phone #",null,null,null,"Fax #"]
[]
[]
["End User Information:"]
[null,null,null,null,null,"Company/Municipal Name"]
[]
[null,null,null,null,null,"Address",null,null,null,null,"City",null,"State","Zip"]
[]
[null,null,null,null,null,"Phone #",null,"Fax #",null,null,"email address"]
[]
["Chassis Dealer:",null,null,null,null,null,"Name:"]
[]
[null,"Chassis Make:",null,null,null,null,null,"Model:"]
[]
[null,"Color:",null,null,null,null,null,"VIN #:"]
[]
[null,null,null,null,null,null,null,"Chassis Frame Height:"]
[null,"Transmission",null,null,null,"Engine"]
[]
[null,null,null,"Chassis Arrival Date:"]
[]
[null,null,null,null,null,null,null,null," "]
[null,null,null,null,null,null,null,"Total Price",null,null,null,null,{"$f":"SUM(M49:O373)","v":0}]
[null,null,null,{"$f":"IF(D47,5%,0)","v":0},null,null,{"$f":"IF(F47,5%,0)","v":0},null,"Discount Structure (20% Standard) ",null,null,null,null,{"$f":"-(1-0.2)*(1-G41)*(1-D41)+1","v":0.19999999999999996}]
[null,"Stock/Demo Discount must be preapproved",null,null,null,null,null,null,null,null,null,"Grand Total (after discount)",{"$f":"+M40*(1-N41)","v":0}]
[]
[null,"ATD",null,"Percent:",0,"or Dollars",0,null,"Authorization:",null,null,null,{"$f":"IF(E44>0,-E44*M42,IF(G44>0,-G44,0))","v":0}]
[null,"ATD Discount must be preapproved",null,null,null,null,null,null,null,null,null,"Grand Total w/ATD",{"$f":"M42+M44","v":0}]
[]
[null,null,null,false,null,false,null,null," ",null,"July 1st 2019 Pricing Rev 1"]
["Quantity",null,"P/N","Description-AIR",null,null,null,null,null,null,"Retail Price",null,"Total"]
["stay",null,null,"Body Size In Cubic Yards"]
[null,null,null,"Standard Full Eject",null,null,null,null,null,null,null,null,{"$f":"+A50*K50","v":0}]
[0,null,9075,"34yd Eject (180-182\" Wheelbase)",null,null,null,null,null,89442,98140.23,null,{"$f":"+A51*K51","v":0}]
[0,null,9070,"40yd Eject  (208\"-210\" Wheelbase)",null,null,null,null,null,90773,99600.67,null,{"$f":"+A52*K52","v":0}]
[null,null,9072,"43yd Eject (208\"-210\" Wheelbase)",null,null,null,null,null,91173,100039.57,null,{"$f":"+A53*K53","v":0}]
[null,null,null,null,null,null,null,null,null,null,null,null,{"$f":"+A54*K54","v":0}]
[null,null,null,"(All WB's are Exclusive of Tag or Pusher Axles)"]
["Quantity",null,null,"Mounting Options - AIR ",null,null,null,null,null,null,"Retail Price",null,"Total Price"]
[{"$f":"IF(A58>0.5,0,\"STD\")","v":"STD"},null,null,"Complete Mount (Standard, No Charge)",null,null,null,null,null,0,{"$f":"$E$40/100*J57","v":0}]
[0,null,107465,"Ship Out (Removes Mounting Services & adds a Mounting Kit including hyd. tank, cab console, wire harness and hoses which must be cut to length and crimped by installer.)",null,null,null,null,null,-2014,-2167.77,null,{"$f":"+K58*A58","v":0}]
[0,null,106240,"Service Hoist",null,null,null,null,null,2922,3145,null,{"$f":"+K59*A59","v":0}]
[0,null,132983,"CNG Chassis Service Fee (Required for all CNG fueled chassis to cover handling and and prepping unit for transport)",null,null,null,null,null,263,283.08,null,{"$f":"+K60*A60","v":0}]
["Quantity",null,null,"Scale Options - AIR",null,null,null,null,null,null,"Retail Price",null,"Total Price"]
[0,null,131234,"Vulcan Scale Installed - Body (6 Point)",null,null,null,null,null,15067,16217.37,null,{"$f":"+K62*A62","v":0}]
[0,null,136774,"Loadman Scale Installed - Body (6 Point)",null,null,null,null,null,14276,15365.97,null,0]
[0,null,132716,"Air Weigh - 3 Axle Scale",null,null,null,null,null,6480,6974.75,null,{"$f":"+K64*A64","v":0}]
[0,null,136713,"Air Weigh - 4 Axle Scale",null,null,null,null,null,8100,8718.44,null,0]
[0,null,131970,"Air Weigh Bin Max Arm Scale with Bluetooth Capability",null,null,null,null,null,11750,12647.11,null,0]
[0,null,131703,"Fork Scales - Vulcan R-506",null,null,null,null,null,12455,13405.94,null,0]
[0,null,127286,"Fork/Arm Scale - Loadman LM300",null,null,null,null,null,22994,24749.59,null,{"$f":"+K68*A68","v":0}]
["Quantity",null,null,"Pump/PTO Options - AIR",null,null,null,null,null,null,"Retail Price",null,"Total Price"]
[{"$f":"IF(A71+A72+A73>0.5,0,\"STD\")","v":"STD"},null,132621,"Front Mount Vane Pump",null,null,null,null,null,0,{"$f":"$E$40/100*J70","v":0}]
[0,null,105963,"Front Mount Muncie MLS Gear Pump                                                                              (Note: Peterbilt chassis reguires 111 5/8\" arms and bumper extension)",null,null,null,null,null,354.28,381.33,null,{"$f":"+K71*A71","v":0}]
[0,null,null,"Hot Shift PTO Mount Gear Pump",null,null,null,null,null,2580,2776.98,null,{"$f":"+K72*A72","v":0}]
[0,null,null,"Hot Shift PTO Mount Vane Pump",null,null,null,null,null,2780,2992.25,null,{"$f":"+K73*A73","v":0}]
["Quantity",null,null,"Axle Assist Options - AIR",null,null,null,null,null,null,"Retail Price",null,"Total Price"]
[null,null,133602,"20,000 lb. Pusher Axle w/Aluminum Rims and Tires (singles only)",null,null,null,null,null,12344,13286.46,null,{"$f":"+K75*A75","v":0}]
[null,null,133603,"20,000 lb. Pusher Axle w/Steel Rims and Tires (singles only)",null,null,null,null,null,11278,12139.08,null,0]
[null,null,133604,"20,000 lb. Pusher Axle w/o Rims and Tires ",null,null,null,null,null,8828,9502.02,null,0]
[]
[null,null,133605,"13,200 lb. Pusher Axle w/Aluminum Rims and Tires  ",null,null,null,null,null,10866,11695.62,null,0]
[null,null,133606,"13,200 lb. Pusher Axle w/Steel Rims and Tires  ",null,null,null,null,null,9801,10549.31,null,0]
[null,null,133607,"13,200 lb. Pusher Axle w/o Rims and Tires  ",null,null,null,null,null,8315,8949.85,null,0]
[]
[0,null,133608,"13,200 lb. Tag Axle w/Aluminum Rims and Tires ",null,null,null,null,null,11678,12569.62,null,0]
[0,null,133609,"13,200 lb. Tag Axle w/Steel Rims and Tires ",null,null,null,null,null,10612,11422.23,null,0]
[0,null,133610,"13,200 lb. Tag Axle w/o Rims and Tires ",null,null,null,null,null,9125,9821.69,null,0]
[]
[0,null,133611,"13,200 lb. Steerable Tag w/Aluminum Rims and Tires                             ",null,null,null,null,null,12779,13754.68,null,0]
[0,null,133612,"13,200 lb. Steerable Tag w/Steel Rims and Tires                              ",null,null,null,null,null,11713,12607.29,null,0]
[0,null,133613,"13,200 lb. Steerable Tag w/o Rims and Tires                              ",null,null,null,null,null,10226,11006.76,null,0]
[{"$f":"SUM(A76:B89)","v":0},null,null,"**Consult Factory For CT/WB Requirements**",null,null,null,null,null,null,null,null,0]
["Quantity",null,null,"Lighting Options - AIR",null,null,null,null,null,null,"Retail Price",null,"Total Price"]
["STD",null,null,"LED Body Lights including Reverse and License Plate",null,null,null,null,null,0,{"$f":"$E$40/100*J92","v":0}]
[0,null,114995,"LED Backup Lights - mounted mid body (2 Lights)",null,null,null,null,null,354,381.03,null,{"$f":"+K93*A93","v":0}]
[0,null,131376,"LED High Intensity Backup Lights - mounted on tailgate (2 Lights)",null,null,null,null,null,409,440.23,null,{"$f":"+K94*A94","v":0}]
[0,null,118750,"LED High Intensity Work Lights (2 Lights in Hopper and 1 on Canopy)",null,null,null,null,null,354,381.03,null,0]
[0,null,133389,"LED Work Lights Mounted on Canopy Directed Toward Can (2 Lights)",null,null,null,null,null,409,440.23,null,0]
[0,null,118816,"Strobe Light Beacon (Surface Mount)",null,null,null,null,null,352,378.88,null,{"$f":"+K97*A97","v":0}]
[null,null,null,"Location--->",null,"Center Tailgate (standard location - edit if other location required)"]
[0,null,131379,"Strobe Light Package (Integrated Strobe System with Turn Signals - 2 round lights mounted in upper tailgate)",null,null,null,null,null,420,452.07,null,{"$f":"+K99*A99","v":0}]
[0,null,131380,"Strobe Light Package (Integrated Strobe System with Turn Signals - 2 round lights mounted in lower tailgate)",null,null,null,null,null,420,452.07,null,0]
[0,null,131381,"LED Round Strobes - 2 lights mounted in upper tailgate",null,null,null,null,null,420,452.07,null,0]
[0,null,131382,"LED Oval Strobes - 2 lights mounted in upper tailgate",null,null,null,null,null,454,488.66,null,0]
[0,null,131383,"LED Oval Strobes - 2 lights mounted in lower tailgate",null,null,null,null,null,454,488.66,null,0]
[0,null,132200,"Upper Light Bar - 2 Stop/Tail lights & 2 Turn Signal lights",null,null,null,null,null,582,463.5,null,0]
[0,null,130440,"Traffic Advisor Board (mounted mid tailgate)",null,null,null,null,null,858,923.51,null,0]
["STD",null,null,"Center Mount Brake (I.D. Cluster)",null,null,null,null,null,0,{"$f":"$E$40/100*J106","v":0}]
[0,null,130209,"Brush Guards For Upper Tailgate Light Bar (protects up to 4 lights)",null,null,null,null,null,181,194.82,null,0]
[0,null,136826,"Wiring Circuit Including switch for customer installed lights (includes switch in cab and 16 ga. wire to designated location)",null,null,null,null,null,170,182.98,null,0]
[null,null,null,"Light Location--->"]
[null,null,null,"Custom Lighting Packages: Consult your RSM for pricing and note in \"Special Instructions\" at bottom",null,null,null,null,null,null,"Consult Factory"]
["Quantity",null,null,"Safety Device Options - AIR",null,null,null,null,null,null,"Retail Price",null,"Total Price"]
[null,null,115670,"Back-up Alarm Upgrade (102 db)",null,null,null,null,null,80,86.11,null,{"$f":"+K112*A112","v":0}]
[null,null,135197,"Back-up Alarm Auto Volume Adjustable (87 - 112 db)",null,null,null,null,null,157,168.99,null,{"$f":"+K113*A113","v":0}]
["STD",null,null,"Over Height Warning Light - Provides visual alert when arms/forks are above cab",null,null,null,null,null,0,{"$f":"$E$40/100*J114","v":0}]
[null,null,119518,"Over Height Warning Buzzer - Provides audible alert when arms/forks are above cab",null,null,null,null,null,189,203.43,null,{"$f":"+K115*A115","v":0}]
[null,null,null,"Back Up Collision Avoidance Sensor - Safety Vision camera system",null,null,null,null,null,743,799.73,null,{"$f":"+K116*A116","v":0}]
[null,null,null,"Back Up Collision Avoidance Sensor - 3rd Eye camera system",null,null,null,null,null,1221,1314.22,null,{"$f":"+K117*A117","v":0}]
[null,null,133508,"Body Hold-down Lock",null,null,null,null,null,250,269.08999999999997,null,{"$f":"+K118*A118","v":0}]
[{"$f":"IF(A120>0.5,0,IF(A58>0.5,0,\"STD\"))","v":"STD"},null,113305,"Fire Extinguisher--10lb. (standard equipment on mounted units only)",null,null,null,null,null,0,{"$f":"$E$40/100*J119","v":0}]
[null,null,113724,"Fire Extinguisher--20lb. (upgrade from 10 lb. - available on mounted units only)",null,null,null,null,null,99,109.92,null,{"$f":"+K120*A120","v":0}]
[null,null,116227,"Triangle Kit (standard equipment and only available on mounted units)",null,null,null,null,null,0,0]
[null,null,113426,"Caution Decal for Tailgate (Large)",null,null,null,null,null,270,290.61,null,{"$f":"+K122*A122","v":0}]
[null,null,128553,"Transition at top of roof from ladder",null,null,null,null,null,864,929.97,null,{"$f":"+K123*A123","v":0}]
[null,null,130550,"Fall Restraint System for Roof",null,null,null,null,null,2916,3138.64,null,{"$f":"+K124*A124","v":0}]
[null,null,126237,"Ladder Down Interlock to Shut Down Hydraulic System",null,null,null,null,null,325,349.81,null,{"$f":"+K125*A125","v":0}]
["Quantity",null,null,"Camera Options-AIR",null,null,null,null,null,null,"Retail Price",null,"Total Price"]
[null,null,null,"Pricing reflects our standard systems with a camera mouted on the center of the tailgate as the first location. Consult your RSM for pricing on specific brands or models and note in Special Instructions section."]
[{"$f":"IF(A131+A134+A137+A140+A143+A146+A149>0.5,0,\"STD\")","v":"STD"},null,134376,"Dual Camera system with 7\" Color Flat Screen Monitor                                                 Center Tailgate location standard - Choose 1 additional location from list below:",null,null,null,null,null,0,{"$f":"$E$40/100*J128","v":0}]
[null,null,null,null,"1st","2nd"]
[null,null,null,null,1]
[null,null,134377,"Triple Camera system with 7\" Color Flat Screen Monitor                                                  Center Tailgate location standard - Choose 2 additional locations from list below:",null,null,null,null,null,658,708.24,null,{"$f":"K131*A131","v":0}]
[null,null,null,null,"1st","2nd","3rd"]
[null,null,null,null,1]
[null,null,134378,"Quad Camera system with 7\" Color Flat Screen Monitor                                                 Center Tailgate location standard - Choose 3 additional locations from list below:",null,null,null,null,null,1151,1238.8800000000001,null,{"$f":"+K134*A134","v":0}]
[null,null,null,null,"1st","2nd","3rd","4th"]
[null,null,null,null,1]
[null,null,136777,"Triple Camera system with 7\" Color Flat Screen Monitor & DVR                                                 Center Tailgate location standard - Choose 2 additional locations from list below:",null,null,null,null,null,2180,2346.44,null,{"$f":"K137*A137","v":0}]
[null,null,null,null,"1st","2nd","3rd"]
[null,null,null,null,1]
[null,null,136270,"Quad Camera system with 7\" Color Flat Screen Monitor & DVR                                                Center Tailgate location standard - Choose 3 additional locations from list below:",null,null,null,null,null,2673,2877.08,null,{"$f":"+K140*A140","v":0}]
[null,null,null,null,"1st","2nd","3rd","4th"]
[null,null,null,null,1]
[null,null,136675,"3rd Eye Dual Camera system with 7\" Color Flat Screen Monitor                                                 Center Tailgate location standard - Choose 1 additional location from list below:",null,null,null,null,null,675,726.54,null,{"$f":"+K143*A143","v":0}]
[null,null,null,null,"1st","2nd"]
[null,null,null,null,1]
[null,null,134010,"3rd Eye Triple Camera system with 7\" Color Flat Screen Monitor                                                  Center Tailgate location standard - Choose 2 additional locations from list below:",null,null,null,null,null,1333,1434.77,null,{"$f":"+K146*A146","v":0}]
[null,null,null,null,"1st","2nd","3rd"]
[null,null,null,null,1]
[null,null,136709,"3rd Eye Quad Camera system with 7\" Color Flat Screen Monitor                                                Center Tailgate location standard - Choose 3 additional locations from list below:",null,null,null,null,null,1991,2143.0100000000002,null,{"$f":"+K149*A149","v":0}]
[null,null,null,null,"1st","2nd","3rd","4th"]
[null,null,null,null,1]
[null,null,null,"Additional Camera Locations"]
[null,null,null,null,null,null,null,1,"Center Tailgate - facing rearward"]
[null,null,null,null,null,null,null,2,"Bulkhead"]
[null,null,null,null,null,null,null,3,"Body - Streetside, facing rearward"]
[null,null,null,null,null,null,null,4,"Midbody - facing into hopper"]
[null,null,null,null,null,null,null,5,"Tailgate - curbside to view alley"]
[null,null,null,null,null,null,null,6,"Dash - facing forward"]
[null,null,null,null,null,null,null,7,"Dash - facing driver"]
[null,null,null,null,null,null,null,99,"Other - describe in Special Instructions section"]
["Quantity",null,null,"Paint Options-AIR",null,null,null,null,null,null,"Retail Price",null,"Total Price"]
[null,null,null,"Two Tone, Custom Paint or Special Designs (Mounted Units Only - Must submit design drawing with this form including detailed dimensions, design specifics, logos and paint codes)  Contact your RSM for pricing and note in \"Special Instructions\""]
[null,null,null,"(We Use Axalta Imron Elite)"]
[{"$f":"1-A169","v":1},null,null,"Code:"]
[{"$f":"IF(A166+A167>0.5,0,\"STD\")","v":"STD"},null,133588,"Acrylic Urethane Enamel (White) - MUST ENTER PAINT CODE ABOVE",null,null,null,null,null,0,{"$f":"$E$40/100*J165","v":0}]
[0,null,136964,"Acrylic Urethane Enamel Color Coat - MUST ENTER COLOR & CODE ABOVE",null,null,null,null,null,1609,1731.85,null,{"$f":"+K166*A166","v":0}]
[null,null,110157,"Two Tone Or Special Design (Mounted Units Only)",null,null,null,null,null,null,"Consult Factory"]
[0,null,133568,"Clear Coat",null,null,null,null,null,2231,2401.34,null,{"$f":"+K168*A168","v":0}]
[0,null,133600,"Prime Inside Body (Recommended for Stock Units)",null,null,null,null,null,567,610.29,null,{"$f":"+K169*A169","v":0}]
[0,null,119124,"Body Undercoating/Bedliner (Mounted Units only - applied from frame rails to edge of hopper and body)",null,null,null,null,null,3270,3519.66,null,{"$f":"+K170*A170","v":0}]
[0,null,136776,"Body Undercoating/Bedliner (Mounted Units only - applied from frame rails to edge of body.  Does not include bottom of hopper)",null,null,null,null,null,2180,2346.44,null,0]
[0,null,136186,"Body Undercoating/Bedliner Applied to Canopy/Cab Cover",null,null,null,null,null,530,570.47,null,0]
["Quantity",null,null,"Steel Options - AIR",null,null,null,null,null,null,"Retail Price",null,"Total Price"]
[{"$f":"IF(A175+A176>0.5,0,\"STD\")","v":"STD"},null,null,"Body Roof 10GA 80K",null,null,null,null,null,0,{"$f":"$E$40/100*J174","v":0}]
[0,null,{"$f":"IF(A$51>0.5,123121,124905)","v":124905},"Body Roof 1/8\" AR450-40YD (123121-34YD)",null,null,null,null,null,645,694.25,null,{"$f":"+K175*A175","v":0}]
[0,null,{"$f":"IF(A$51>0.5,124940,123734)","v":123734},"Body Roof 3/16\" AR450-40YD (124940-34YD)",null,null,null,null,null,1255,1350.82,null,{"$f":"+K176*A176","v":0}]
[]
["STD",null,130545,"Roof Door Solid Metal 14GA",null,null,null,null,null,0,0]
[]
[{"$f":"IF(A181>0.5,0,\"STD\")","v":"STD"},null,null,"Body Sides 1/8\" AR450",null,null,null,null,null,0,0]
[0,null,{"$f":"IF(A$51>0.5,132413,130528)","v":130528},"Body Sides 3/16\" AR450-40YD (132413-34YD)",null,null,null,null,null,1289,1387.42,null,{"$f":"+K181*A181","v":0}]
[]
[{"$f":"IF(A184+A185>0.5,0,\"STD\")","v":"STD"},null,null,"Body Floor 3/16\" AR235",null,null,null,null,null,0,0]
[0,null,{"$f":"IF(A$51>0.5,124907,131221)","v":131221},"Body Floor 3/16\" AR450-40YD (124907-34YD)",null,null,null,null,null,876,942.88,null,{"$f":"+K184*A184","v":0}]
[0,null,{"$f":"IF(A$51>0.5,131714,129928)","v":129928},"Body Floor to 1/4\" 100K-40YD (131714-34YD)",null,null,null,null,null,936,1007.46,null,{"$f":"+K185*A185","v":0}]
[0,null,131448,"Body Floor Liner 36\" Into Body 3/16\" AR450",null,null,null,null,null,645,694.25,null,{"$f":"+K186*A186","v":0}]
[0,null,{"$f":"IF(A$51>0.5,132995,130017)","v":130017},"Body Floor Liner Full Length 3/16\" AR450-40YD (132995-34YD)",null,null,null,null,null,1934,2081.66,null,{"$f":"+K187*A187","v":0}]
[]
[{"$f":"IF(A190>0.5,0,\"STD\")","v":"STD"},null,null,"Hopper Sides 3/16\" AR450",null,null,null,null,null,0,0]
[0,null,130203,"Hopper Sides 1/4\" AR450",null,null,null,null,null,1044,1123.71,null,{"$f":"+K190*A190","v":0}]
[]
[{"$f":"IF(A193>0.5,0,\"STD\")","v":"STD"},null,null,"Hopper Floor 1/4\" AR450",null,null,null,null,null,0,0]
[0,null,130015,"Hopper Floor Liner 3/16\" AR450",null,null,null,null,null,1934,2081.66,null,{"$f":"+K193*A193","v":0}]
[]
[{"$f":"IF(A196>0.5,0,\"STD\")","v":"STD"},null,127965,"Front Sump w/ Dual Clean Out Doors",null,null,null,null,null,0,0]
[0,null,132680,"No Hopper Cleanouts (Deduct)",null,null,null,null,null,-584,-628.59,null,{"$f":"+K196*A196","v":0}]
[]
[{"$f":"IF(A199>0.5,0,\"STD\")","v":"STD"},null,null,"Tailgate Bubble 1/8\" AR450",null,null,null,null,null,0,0]
[0,null,130974,"Tailgate Bubble 3/16\" AR450",null,null,null,null,null,644,693.17,null,{"$f":"+K199*A199","v":0}]
[]
[{"$f":"IF(A202>0.5,0,\"STD\")","v":"STD"},null,null,"Packer Panel Lower Face 3/16\" AR450",null,null,null,null,null,0,0]
[0,null,130525,"Packer Panel Lower Face Liner 3/16\" AR450",null,null,null,null,null,644,693.17,null,{"$f":"+K202*A202","v":0}]
[{"$f":"IF(A204>0.5,0,\"STD\")","v":"STD"},null,null,"Packer Panel Sloped Face 3/16\" AR450",null,null,null,null,null,0,0]
[0,null,130526,"Packer Panel Sloped Face & Lower Liners 3/16\" AR450",null,null,null,null,null,1095,1178.5999999999999,null,{"$f":"+K204*A204","v":0}]
[0,null,130212,"Packer Panel Construction Grade (3/16\" AR450 lower liner, \n(3) 3x3 horizontal cross braces)",null,null,null,null,null,1032,1110.79,null,{"$f":"+K205*A205","v":0}]
[0,null,128961,"Super Track Bottom Wear Strip (Hopper Only)-40YD",null,null,null,null,null,2271,2444.39,null,{"$f":"+K206*A206","v":0}]
[0,null," "," ",null,null,null,null,null,0,0,null,{"$f":"+K207*A207","v":0}]
[null,null,127683,"Steel Canopy (short extension)",null,null,null,null,null,0,0]
[{"$f":"IF(A210+A211+A212+A213>0.5,0,\"STD\")","v":"STD"},null,127684,"Steel Canopy (long extension)",null,null,null,null,null,0,0]
[0,null,127681,"Aluminum Canopy (short extension)",null,null,null,null,null,923,993.47,null,{"$f":"+K210*A210","v":0}]
[0,null,127682,"Aluminum Canopy (long extension)",null,null,null,null,null,923,993.47,null,{"$f":"+K211*A211","v":0}]
[0,null,132153,"Aluminum Canopy With Air Cylinder Extension",null,null,null,null,null,1296,1394.95,null,{"$f":"+K212*A212","v":0}]
[0,null,133999,"Steel Canopy With Steel Extension that is Air Raised",null,null,null,null,null,774,833.09,null,{"$f":"+K213*A213","v":0}]
[0,null,136780,"Torque Tube Reinforcement Inserts",null,null,null,null,null,181,194.82,null,{"$f":"+K214*A214","v":0}]
[null,null,null,"Custom Steel Packages: Consult your RSM for pricing and note in \"Special Instructions\" at bottom",null,null,null,null,null,null,"Consult Factory"]
["Quantity",null,null,"Hydraulics - AIR",null,null,null,null,null,null,"Retail Price",null,"Total Price"]
["STD",null,null,"Filter By-Pass Visual Indicator on Filter Housing",null,null,null,null,null,0,{"$f":"$E$40/100*J217","v":0},null,0]
[0,null,120152,"Filter By-Pass Visual Indicator In Cab",null,null,null,null,null,252,271.24,null,{"$f":"+K218*A218","v":0}]
[0,null,132266,"High Temperature Fluid Switch Visual Indicator in Cab",null,null,null,null,null,495,532.79,null,{"$f":"+K219*A219","v":0}]
[0,null,132267,"Low Fluid Level Switch Visual Indicator in Cab",null,null,null,null,null,495,532.79,null,{"$f":"+K220*A220","v":0}]
[0,null,104231,"Hydraulic Shut Down When One or More of the Following Condtitions Exist:  Filter By-Pass, High Temperature Fluid and/or Low Fluid Level (NOTE: REQUIRES VISUAL INDICATOR IN CAB FOR EACH INPUT) ",null,null,null,null,null,528,568.30999999999995,null,{"$f":"+K221*A221","v":0}]
[0,null,104217,"Hour Meter on PTO",null,null,null,null,null,268,288.45999999999998,null,0]
[0,null,115506,"In Tank Oil Heater (120 Volt w/plug in)",null,null,null,null,null,1408,1515.5,null,0]
["STD",null,null,"Aluminum Oil Tank With In Tank Filtration",null,null,null,null,null,0,0]
[0,null,127714,"High Pressure Filter-Schroeder",null,null,null,null,null,1451,1561.78,null,{"$f":"+K225*A225","v":0}]
["STD",null,null,"Quick Disconnect Port for Pressure Gage",null,null,null,null,null,0,0,null,0]
[0,null,124738,"Quick Disconnect Pressure Gage",null,null,null,null,null,96,106.34,null,{"$f":"+K227*A227","v":0}]
[null,null,null,"Custom Hydraulic Packages:  Consult your RSM for pricing and note in \"Special Instructions\" at bottom",null,null,null,null,null,null,"Consult Factory"]
["Quantity",null,null,"Fork and Arm Options - AIR",null,null,null,null,null,null,"Retail Price",null,"Total Price"]
[{"$f":"IF(A231>0.5,0,\"STD\")","v":"STD"},null,133465,"Single Handle Quad Control Joystick",null,null,null,null,null,0,{"$f":"$E$40/100*J230","v":0}]
[0,null,133466,"Dual Lever Controls",null,null,null,null,null,468,503.73,null,{"$f":"+K231*A231","v":0}]
[]
[{"$f":"IF(A234>0.5,0,\"STD\")","v":"STD"},null,null,"8,000 lb. Lift Rating Arms including 4.5\" Arm Cylinder and 3.5\" Fork Cylinder",null,null,null,null,null,0,{"$f":"$E$40/100*J233","v":0}]
[0,null,132955,"10,000 lb. Lift Rating Arms including 5\" Arm Cylinder and 4\" Fork Cylinder",null,null,null,null,null,2173,2338.91,null,{"$f":"+K234*A234","v":0}]
[null,null,null,null,null,null,null,null,null,null,null,null,null,null,null,null,null," "]
[{"$f":"IF(A238+A240+A242+A243+A244+A246+A247+A248+A249+A250+A252+A253+A254+A256+A257>0.5,0,\"STD\")","v":"STD"},null,110122,"Fork Thickness 1 1/4\" 100K with hook (44\" usable bumper to hook)",null,null,null,null,null,0,{"$f":"$E$40/100*J236","v":0}]
[]
[0,null,129844,"Fork Thickness 1\" 100K smooth no hook (48\" usable bumper to tip)",null,null,null,null,null,null,0]
[]
[0,null,112140,"Fork Thickness 1 1/4\" 100K smooth no hook (48\" usable bumper to tip)",null,null,null,null,null,138,148.54,null,{"$f":"+K240*A240","v":0}]
[]
[0,null,121901,"Fork Thickness 1 1/4\" 100K with hook (48\" usable bumper to hook)",null,null,null,null,null,184,198.05,null,{"$f":"+K242*A242","v":0}]
[0,null,125087,"Fork Thickness 1 1/4\" 100K with hook (58-1/2\" usable bumper to hook)",null,null,null,null,null,386,415.47,null,{"$f":"+K243*A243","v":0}]
[0,null,125085,"Fork Thickness 1 1/4\" 100K with hook (66\" usable bumper to hook)",null,null,null,null,null,678,729.77,null,{"$f":"+K244*A244","v":0}]
[]
[0,null,108746,"Fork Thickness 1 1/2\" 100K with hook (44\" usable bumper to hook)",null,null,null,null,null,392,421.93,null,0]
[0,null,121843,"Fork Thickness 1 1/2\" 100K with hook (48\" usable bumper to hook)",null,null,null,null,null,486,523.11,null,0]
[0,null,125084,"Fork Thickness 1 1/2\" 100K with hook (58\" usable bumper to hook)",null,null,null,null,null,721,776.05,null,0]
[0,null,120162,"Fork Thickness 1 1/2\" 100K with hook (61\" usable bumper to hook)",null,null,null,null,null,791,851.39,null,0]
[0,null,124649,"Fork Thickness 1 1/2\" 100K with hook (66\" usable bumper to hook)",null,null,null,null,null,909,978.4,null,0]
[]
[0,null,125082,"Fork Thickness 1 1/2\" 100K smooth no hook (48\" usable bumper to tip)",null,null,null,null,null,486,523.11,null,0]
[0,null,130055,"Fork Thickness 1 1/2\" 100K smooth no hook (58-1/2\" usable bumper to tip)",null,null,null,null,null,721,776.05,null,0]
[0,null,109306,"Fork Thickness 1 1/2\" 100K smooth no hook (65\" usable bumper to tip)",null,null,null,null,null,909,978.4,null,0]
[]
[0,null,132061,"Fork Width Adjustment Hydraulic (both sides  22\" ea) 51\" Usable Smooth 1 1/2\"",null,null,null,null,null,3028,3259.19,null,{"$f":"+K256*A256","v":0}]
[0,null,132858,"Fork Width Adjustment Hydraulic (both sides  22\" ea) 47\" Usable Hook",null,null,null,null,null,2934,3158.01,null,0]
[]
[0,null,118855,"Fork Limiter to retain can on forks during dumping",null,null,null,null,null,189,203.43,null,{"$f":"+K259*A259","v":0}]
[0,null,130177,"Fork Cylinders Upgrade - Increase from 3.5\" to 4\" Diameter",null,null,null,null,null,345,371.34,null,0]
[null,null,null,null,null,null,null,null,null,null,null,null,0]
[null,null,null,"Residential Package Options - AIR"]
[null,null,null," Note: Auto Dump and Self Level NOT Available on Air Models.                                You must select CANBUS for Auto Dump and Self Level Options."]
[0,null,110155,"Outside Controls For Arms, Forks, Packing w/ E- Stop",null,null,null,null,null,1335,1436.93,null,0]
[0,null,132288,"Curbside In Cab Arm/Fork Controls",null,null,null,null,null,1129,1215.2,null,0]
[0,null,131628,"Deceleration On Arms Down Function",null,null,null,null,null,1031,1109.72,null,{"$f":"+K266*A266","v":0}]
[0,null,130546,"Cradle Support for Arms Down",null,null,null,null,null,482,518.79999999999995,null,{"$f":"+K267*A267","v":0}]
[0,null,130551,"Curotto Can Ready with Controls, Plumbing to Quick Disconnects at Fork Pivot, Harnesses, Cradle to Support Arms Down and Deceleration Arms Down  \n(With Out Automated Arm and Can)                                                                              \nNote: Auto Dump NOT Available on AIR System",null,null,null,null,null,13855,14912.83,null,{"$f":"+K268*A268","v":0}]
[0,null,132218,"Complete Residential Package Including: Residential Carry Can w/tipper fork cradle\n(includes curbside in cab arm/fork controls)",null,null,null,null,null,10935,11769.89,null,{"$f":"+K269*A269","v":0}]
[0,null,131468,"Plumb Only For Residential Container (Includes Tap-In and Plumbing to front forks)",null,null,null,null,null,1809,1947.12,null,{"$f":"+K270*A270","v":0}]
[null,null,null,"Custom Arm/Fork Options:  Consult your RSM for pricing and note in \"Special Instructions\" at bottom",null,null,null,null,null,null,"Consult Factory"]
["Quantity",null,null,"Accessories - AIR",null,null,null,null,null,null,"Retail Price",null,"Total Price"]
[0,null,130571,"Shovel/Broom Rack",null,null,null,null,null,197,212.04,null,{"$f":"+K273*A273","v":0}]
[null,null,null,"Location:","Back side of front bulkhead screen"]
[0,null,130175,"Extending cleaning tool with broom attachment and holder",null,null,null,null,null,285,306.76,null,{"$f":"+K275*A275","v":0}]
[0,null,104252,"Steel Tool Box 18x18x24 (must confirm space available to mount)",null,null,null,null,null,526,566.16,null,0]
[0,null,104253,"Steel Tool Box 18x18x36 (must confirm space available to mount)",null,null,null,null,null,615,661.96,null,0]
[0,null,104254,"Steel Tool Box 18x18x48 (must confirm space available to mount)",null,null,null,null,null,674,725.46,null,0]
[0,null,115378,"Container Washout Tank Air 35 Gallon (must confirm space available to mount)",null,null,null,null,null,1566,1685.56,null,0]
[0,null,113771,"Container Washout Tank Air 50Gallon (must confirm space available to mount)",null,null,null,null,null,1691,1820.11,null,0]
[0,null,129862,"Container Disinfectant Tank Elec. 50 Gallon (must confirm space available to mount)",null,null,null,null,null,2394,2576.7800000000002,null,0]
[0,null,114463,"Auto Lube (Up to 20 Points)",null,null,null,null,null,6038,6499,null,0]
[0,null,131218,"Remote Grease tailgate hinge & cylinders",null,null,null,null,null,378,406.86,null,{"$f":"+K283*A283","v":0}]
[{"$f":"IF(A285+A286>0.5,0,\"STD\")","v":"STD"},null,120908,"Sliding Access Door (Fiber Glass)",null,null,null,null,null,0,{"$f":"$E$40/100*J284","v":0}]
[0,null,123701,"Sliding Access Door (Steel)",null,null,null,null,null,414,445.61,null,{"$f":"+K285*A285","v":0}]
[0,null,130487,"Dual Access Door",null,null,null,null,null,526,566.16,null,0]
[0,null,130304,"Rubber Fender Skirt Extension (Required for rear tires wider than 98.5\")-40yd\n(130734-34YD)",null,null,null,null,null,270,290.61,null,0]
[0,null,129845,"National Standard Fire Hose Port",null,null,null,null,null,1296,1394.95,null,0]
[0,null,130176,"Aluminum Drip Pan Below Tailgate Seal (135871-Autocar 4-axle)",null,null,null,null,null,729,784.66,null,0]
[0,null,128856,"Upper Tailgate Seal Extension Rubber (Std. 36\" + Additional 36\" Drip Guard)",null,null,null,null,null,596,641.5,null,0]
[null,null,null,"Custom Accessories:  Consult your RSM for pricing and note in \"Special Instructions\" at bottom",null,null,null,null,null,null,"Consult Factory"]
["Quantity",null,null,"Warranty Options - AIR",null,null,null,null,null,null,"Retail Price",null,"Total Price"]
["stay",null,null,"All Warranties Are Conditional--Refer To Warranty Statement"]
[]
[{"$f":"IF(A296+A297+A298>0.5,0,\"STD\")","v":"STD"},null,null,"2-Year Cylinder Warranty",null,null,null,null,null,0,{"$f":"$E$40/100*J295","v":0}]
[null,null,119324,"3-Year Cylinder Warranty",null,null,null,null,null,1835,1975.1,null,{"$f":"+K296*A296","v":0}]
[null,null,119325,"4-Year Cylinder Warranty",null,null,null,null,null,4171,4489.46,null,{"$f":"+K297*A297","v":0}]
[null,null,119326,"5-Year Cylinder Warranty",null,null,null,null,null,5283,5686.36,null,{"$f":"+K298*A298","v":0}]
[1,null,null,null,null,null,null,null,null,null,null,null,{"$f":"+K299*A299","v":0}]
[{"$f":"IF(A301+A302+A303+A304>0.5,0,\"STD\")","v":"STD"},null,119327,"1-Year Body Warranty",null,null,null,null,null,0,{"$f":"$E$40/100*J300","v":0}]
[null,null,119328,"2-Year Body Warranty",null,null,null,null,null,1285,1383.11,null,{"$f":"+K301*A301","v":0}]
[null,null,121178,"3-Year Body Warranty",null,null,null,null,null,2570,2766.22,null,{"$f":"+K302*A302","v":0}]
[null,null,130547,"4-Year Body Warranty",null,null,null,null,null,3856,4150.41,null,{"$f":"+K303*A303","v":0}]
[null,null,124531,"5-Year Body Warranty",null,null,null,null,null,5044,5429.11,null,{"$f":"+K304*A304","v":0}]
[null,null,null,null,null,null,null,null,null,null,null,null,{"$f":"+K305*A305","v":0}]
[{"$f":"IF(A307+A308+A309+A310>0.5,0,\"STD\")","v":"STD"},null,116572,"1-Year Hydraulic Warranty",null,null,null,null,null,0,{"$f":"$E$40/100*J306","v":0}]
[null,null,119329,"2-Year Hydraulic Warranty",null,null,null,null,null,1604,1726.47,null,{"$f":"+K307*A307","v":0}]
[null,null,119330,"3-Year Hydraulic Warranty",null,null,null,null,null,2403,2586.4699999999998,null,{"$f":"+K308*A308","v":0}]
[null,null,119345,"4-Year Hydraulic Warranty (Excludes Cylinders)",null,null,null,null,null,3242,3489.53,null,{"$f":"+K309*A309","v":0}]
[null,null,119331,"5-Year Hydraulic Warranty (Excludes Cylinders)",null,null,null,null,null,4080,4391.51,null,{"$f":"+K310*A310","v":0}]
[0]
[0,null,null,"Note: All Extended Hydraulic/Cylinder Warranties include a spare set of \nreplacment filters and breather",null,null,null,null,null,null,"Consult Factory"]
["Special Instructions (Consult Factory for Pricing)"]
["Quantity",null,"Instruction",null,null,null,null,null,null,null,"Retail Price",null,"Total Price"]
[null,null,null,null,null,null,null,null,null,null,null,null,{"$f":"+K315*A315","v":0}]
[null,null,null,null,null,null,null,null,null,null,null,null,0]
[null,null,null,null,null,null,null,null,null,null,null,null,0]
[null,null,null,null,null,null,null,null,null,null,null,null,0]
[null,null,null,null,null,null,null,null,null,null,null,null,0]
[null,null,null,null,null,null,null,null,null,null,null,null,0]
[null,null,null,null,null,null,null,null,null,null,null,null,0]
[null,null,null,null,null,null,null,null,null,null,null,null,0]
[null,null,null,null,null,null,null,null,null,null,null,null,0]
[null,null,null,null,null,null,null,null,null,null,null,null,0]
[null,null,null,null,null,null,null,null,null,null,null,null,0]
[null,null,null,null,null,null,null,null,null,null,null,null,0]
[null,null,null,null,null,null,null,null,null,null,null,null,0]
[null,null,null,"IF ANY ADDITIONAL ROWS ARE ADDED, CONFIRM $ VALUES ARE ADDED TO THE TOTAL"]
[null,null,null,"BELOW - LIST BREIF SUMMARY OF DELIVERY REQUEST"]

{"sheet":"BODY SPEC CURVE   SUMMARY","index":4,"n_rows":107,"n_cols":3,"rows_kept":107,"cut":false,"hidden":false,"merged":[[0,0,0,2]]}
["SUBJECT TO CHANGE -- REFER TO WEB SITE FOR LATEST SPECIFICATIONS"]
["SPEC","CURVED BODY MAMMOTH","CURVED BODY LIGHT WEIGHT MAMMOTH"]
["Body"]
["Main Body Rails","1/4\" x 2\" x 6\" A500B TUBE","1/4\" x 2\" x 6\" A500B TUBE"]
["Hopper Floor","¼” AR450 ","3/16\" AR450"]
["Body Floor","3/16” AR235","1/8\" AR450"]
["Floor Braces","NONE, CURVED FLOOR","NONE, CURVED FLOOR"]
["Center Deck","Formed 1/4\" Plate Capping  1/4\"x4\"x 6\" A500B Tubes, 1/2\" Arm Cyl Lug","Formed 3/16\" Plate Capping  1/4\"x4\"x 4\" A500B Tubes, 1/2\" Arm Cyl Lug"]
["Mounting Brackets","Formed 3/8\" 100K Plate","Formed 3/8\" 100K Plate"]
["Ejection Panel Tracks","Formed 1/4\" GR50 Track lined with 1/4\" x 3\" Flat AR450 Wear Strips","Formed 7GA GR100 Track lined with 1/4\" x 3\" Flat AR450 Wear Strips"]
["Hopper Side Walls","3/16\" AR450 (1-PC WALLS)","3/16\" AR450 (1-PC WALLS)"]
["Body Side Walls","1/8\" AR450","1/8\" AR450"]
["Roof","10 GA GR80","12 GA GR80"]
["Rear Frame Top & Sides","Formed 10GA GR80 Frames","Formed 10GA GR80 Frames"]
["Rear Frame Lower ","Formed 10GA GR80 Frames","Formed 10GA GR80 Frames"]
["Tailgate Hinge Lugs","3/8\" 100K","3/8\" 100K"]
["Access Door","31\" x 31\" Door Opening","31\" x 31\" Door Opening"]
["Upper Body Fill Plate (Transition)","14 GA A36","14 GA A36"]
["Upper Body Brush Guards","1/4\" GR80","10GA GR80"]
["Body Height","110-3/4\"","110-3/4\""]
["Overall Height with Tailgate Raised","150\"","150\""]
["Body Length","43yd-311\", 40yd-296\", 34yd-260\"","43yd-311\", 40yd-296\", 34yd-260\""]
["Overall Length with Tailgate Raised","43yd & 40yd-380\", 34yd-344\"","43yd & 40yd-380\", 34yd-344\""]
["Inside Width","88\"","88\""]
["Max Outside Width","101-1/2\"","101-1/2\""]
["Approximate Body Weight (lbs)*","43YD-17,400lbs; 40yd-17,200lbs; 34yd-16,500lbs","43yd-15,750lbs; 40yd-15,550lbs; 34yd-14,900lbs"]
["Sump (Y/N)","Yes","Yes"]
["Sump Capacity","145 Gal.","145 Gal."]
["Clean out Trough (Y/N)","Y","Y"]
["Body Capacities","34yd, 40yd, 43yd","34yd, 40yd, 43yd"]
["Available Side Cleanouts Yes/No","Y","Y"]
["Cleanout Capacity","8.60 Gal. Per Side, 17.2 Gal. Total","8.60 Gal. Per Side, 17.2 Gal. Total"]
["Canopy"]
["Length & Width","66\" x 83\"","66\" x 83\""]
["Material","12 GA Steel","12 GA Aluminum"]
["Tailgate"]
["Tailgate Capacity","3yd³, 5.8yd³","3yd³, 5.8yd³"]
["Tailgate Inside Height","91-1/2\"","91-1/2\""]
["Tailgate inside Width","88\"","88\""]
["Tailgate Hopper Bubble","10GA AR450","10GA AR450"]
["Tailgate Sides ","10GA GR80","12GA GR80"]
["Tailgate Seal Height","36\"","36\""]
["Tailgate Hinge Lugs","1\" 100K","1\" 100K"]
["Roof Door"]
["Roof Door Size","92\" Long x 84\" Wide","92\" Long x 84\" Wide"]
["Roof Door Structure","11 GA 1\"x2\" Tube, Formed 1/4\" GR80 Plate","11 Ga. 1\"x2\" Tube, Formed 10 GA GR80 Plate"]
["Roof Door Cover","14 GA A36","1/8\" Expanded Metal"]
["Roof Door Cyl. Lug","1/2\" GR80","1/2\" GR80"]
[]
["Ejection Panel"]
["Base & Support Structure","Formed 10GA GR80 Tube, 1/4\"x3\"x3\" A500B Tube, \n3/16\"x3\"x4\" A500B Tube 3/8\" GR50 & 1/4\" GR80 Plate ","Formed 10GA GR80 Tube, 1/4\"x3\"x3\" A500B Tube, \n3/16\"x3\"x4\" A500B Tube 3/8\" GR50 & 1/4\" GR80 Plate "]
["Sloped Face Sheet","3/16\" AR450","3/16\" AR450"]
["Bottom Face Sheet","3/16\" AR450","3/16\" AR450"]
["Shoes/Wear Pads","1/4\" Tubing With 1/4\"x3\" Flat AR400 Welded To The Shoe","1/4\" Tubing With 1/4\"x3\" Flat AR400 Welded To The Shoe"]
["Cylinder Supports","1/4\" GR80 Plate","1/4\" GR80 Plate"]
["Cylinder Pin","2-1/2\" 1018CD","2-1/2\" 1018CD"]
[]
["Bulkhead/Pivot"]
["Base Structure with Pillow Blocks","Formed 1/4\" GR80 Plate, 3/16\" x 4\" x 6\" A500B Tube,\n 3/16\" x 2\" x 4\" A500B Tube With 1/4\" GR80 Support Plates","Formed 7GA GR100 Plate, 3/16\" x 4\" x 6\" A500B Tube,\n 3/16\" x 2\" x 4\" A500B Tube With 7GA GR100 Support Plates"]
["Pivot Shaft","3-1/2\" x 4-1/2\" 1026 DOM","3-1/2\" x 4-1/2\" 1026 DOM"]
["Pivot Shaft Length","97\"","97\""]
["Pillow Blocks","3\" x  8\" x 8-5/8\" Split With Split SAE 660 Bronze Bushing Two Outer Locations;\n2\" x  8\" x 8-5/8\" Split With Split SAE 660 Bronze Bushing Two Inner Locations","3\" x  8\" x 8-5/8\" Split With Split SAE 660 Bronze Bushing Two Outer Locations;\n2\" x  8\" x 8-5/8\" Split With Split SAE 660 Bronze Bushing Two Inner Locations"]
["Arm to Pivot Shaft Lug","1\" GR50 Plate","1\" GR50 Plate"]
["Bulkhead Upright Structure","3/16\"x3\"x 6\" A500B Tube","3/16\"x3\"x 6\" A500B Tube"]
["Bulkhead Cyl. Support Plates","(3) 1/2\" GR80 Plate","(3) 3/8\" GR100 Plate"]
["Bulkhead Ejection Panel Cyl. Bushings","2-1/2\" A36 Half Lug Blocks","2-1/2\" A36 Half Lug Blocks"]
["Bulkhead Ejection Panel Cyl. Pin","2-1/2\" 1018CD","2-1/2\" 1018CD"]
[]
["Fork"]
["Fork","1-1/4\" T1 STD, 1\" T1 OPT, 1-1/2\" T1 OPT  (T1=100K)","1-1/4\" T1 STD, 1\" T1 OPT, 1-1/2\" T1 OPT  (T1=100K)"]
["Fork Style Hook End Useable Length","44\" (STD), 48\",58\", 66\"","44\", 48\",58\", 66\""]
["Fork Style Smooth Useable Length","48\", 58\", 65\"","48\" (LW STD), 58\", 65\""]
["Pivot Shaft","3-1/2\" x 4-1/2\" 1026 DOM","3-3/4\" x 4 1/2\" 1026 DOM"]
["Pivot Shaft Length","102\"","102\""]
["Bump Pads","Yes","Yes"]
["Fork Cyl. Pin","1-1/2\" 1144 Stress Proof","1-1/2\" 1144 Stress Proof"]
[]
["Arms"]
["Arm Sizes","108-1/2\" & 111-5/8\"","108-1/2\" & 111-5/8\""]
["Arm Skins","3/16\" AR450 STD; 1/4\" 100K OPT","3/16\" AR450 STD"]
["Arm Width And Height With 3/16\" Skins","3-3/8\" Wide, 11\" Tall","3-3/8\" Wide, 11\" Tall"]
["Arm Width And Height With 1/4\" Skins","3-1/2\" Wide, 11\" Tall","3-1/2\" Wide, 11\" Tall"]
["Arm Pivot Shaft","3-1/2\" x 4-1/2\"  1026 DOM","3-1/2\" x 4-1/2\"  1026 DOM"]
["Arm Pivot Shaft Length","97\"","97\""]
["Arm Cyl. Pin","2\" 1144 Stress Proof","2\" 1144 Stress Proof"]
["Arm Cyl Lug Center Deck ","1/2\" GR80 & 1/4\" GR80","1/2\" GR80, 3/16\" GR100 & 3/8\" GR50"]
[]
["Hydraulics"]
["Tank Capacity","70 GALLON WITH 100 MESH 141 MICRON SUCTION STRAINER","70 GALLON WITH 100 MESH 141 MICRON SUCTION STRAINER"]
["Pump Flow","55 gal. @ 1550 RPM","55 gal. @ 1550 RPM"]
["Filter","10 Micron","10 Micron"]
["Hoses","4 to 1 Burst","4 to 1 Burst"]
["Operating Pressure",2450,2250]
[]
["Cylinders"]
["Arm","(2) 4-1/2\" Bore, 45-1/4\" Stroke, 2\" Rod","(2) 4-1/4\" Bore, 45-1/4\" Stroke, 2\" Rod"]
["Roof Door ","(1) 2-1/2\" Bore, 92\" Stroke, 1-1/4\" Rod","(1) 2 1/2\" Bore, 92\" Stroke, 1-1/4\" Rod"]
["Tailgate","(2) 3\" Bore, 25-1/2\" Stroke, 2\" Rod","(2) 3\" Bore, 25-1/2\" Stroke, 2\" Rod"]
["Ejection Panel","(2) 34yd 6-1/2\" 3 Stage, 150\"; 40 & 43yd 6-1/2\" 3 Stage, 182\"; 5-1/2\" OPT","(2) 34yd 5-1/2\" 3 Stage, 150\"; 40 & 43yd 5-1/2\" 3 Stage, 182\"; 6-1/2\" OPT"]
["Fork","(2) 3-1/2\" Bore, 24\" Stroke, 1-1/2\" Rod","(2) 3-1/2\" Bore, 24\" Stroke, 1-1/2\" Rod"]
["Body Lift","N/A","N/A"]
[]
["Chassis"]
["Minimum GVWR (in lbs)**","34yd 56,000 lbs;  40yd & 43yd 64,000 lbs","34yd 56,000 lbs;  40yd & 43yd 64,000 lbs"]
["Recommended Cab to Trunion","34yd 180\"-182\"; 40yd & 43yd 208\"-210\"","34yd 180\"-182\"; 40yd & 43yd 208\"-210\""]
["* Approximate body weight empty and exclusive of options"]
["** Any chassis sent to Scranton Manufacturing with less than the minimum guideline requirements will not be mounted. (Chassis must be capable of carrying the net weight of the body plus the weight of the refuse collected)"]

{"sheet":"CNG PRICING AGILITY","index":5,"n_rows":7,"n_cols":9,"rows_kept":7,"cut":false,"hidden":false,"merged":[[0,0,0,8],[5,0,5,8],[6,0,6,8]]}
["CNG CAPACITIES AGILITY OFFERINGS DEALER NET$$$"]
["MODEL","60 DGE BOC","75 DGE BOC","100 DGE BOC","60 DGE ROOF","80 DGE ROOF","92 DGE ROOF","60 DGE TAILGATE","75 DGE TAILGATE"]
["WEIGHT OF TANKS","1350 LBS.","2050 LBS.","2149 LBS.","1350 LBS.","1650 LBS.","2149 LBS.","1500 LBS.","1850 LBS."]
["34YD FL","N/A","N/A","N/A",29085,"N/A","N/A",32126,34950]
["40YD, 43YD FL","N/A","N/A","N/A",29085,33921,"N/A",32126,34950]
["*ADD $1357.00 FOR FRONT BUMPER FILL"]
["**ADD $425 FOR COLOR MATCH PAINT"]

{"sheet":"Log of Updates","index":6,"n_rows":8,"n_cols":5,"rows_kept":8,"cut":false,"hidden":false,"merged":[]}
[null,"SHEETS AFFECTED","UPDATED BY:","DATE","UPDATES"]
[null,"All","Ben Mason","2018-07-25","Added option numbers 131234, 131970, 131703 & 127286 to scale options;\nAdded option number 131377 to Lighting Options;\nUpdated pump number from 117110 to 132621;"]
[null,"LW & STD CANBUS","Ben Mason","2018-07-25","Added option numbers for 131373 & 131114 to Lighting Options;\nUpdated Res Cont Plumb option from 109267 to 131467;"]
[null,"LW & STD AIR","Ben Mason","2018-07-25","Updated Res Cont Plumb option from 109267 to 131468;"]
[null,"All","Ben Mason","2019-04-12","Updated opion numbers on all price sheets"]
[null,"4 fel","MG","701/19","updated pricing"]
[null,"std air","mg","7/172019","price for strobe pkg upper tailgate, "]
["REV 1","all","mg","2019-07-16","long canopy std"]